program: Gaussian 09
title: 000107754
version: EM64L-G09RevD.01
frameworkgroup: C1[X(C4H10N3O2)]
method: RPBEPBE
basis: SDD
operation: Freq
keyword: #p
keyword: freq=noraman
keyword: PBEPBE/SDD
title: #p freq=noraman PBEPBE/SDD
converged: YES YES NO NO
title: Mulliken charges:
elementType: O O N N N C C C C H H H H H H H H H H
charge: -0.448938 -0.425958 -0.050860 -0.022519 -0.058037 -0.294424 -0.291667 -0.706946 -0.703750 0.197445 0.163229 0.164184 0.194355 0.222281 0.259434 0.161193 0.253688 0.229069 0.158223
chargesum: -1.00000
title: Mulliken charges with hydrogens summed into heavy atoms:
elementType: O O N N N C C C C
charge: -0.448938 -0.425958 -0.050860 -0.022519 -0.058037 0.066249 0.066871 -0.064038 -0.062771
polarizability: 7.73059225e+01 -4.93147364e+00 8.85522389e+01 4.41195608e+00 -8.13405118e+00 7.75783073e+01
1716.lowfreq: -16.1744 -14.9614 0.0001 0.0007 0.0008 4.8490 14.7062 54.3833 64.0453
frequency: 14.6030 54.3356 63.5889 136.5230 170.7096 195.2361 235.1500 249.7760 264.7358 311.9904 378.8318 415.6985 452.7737 534.1876 564.1797 658.2306 790.8330 811.8761 830.4845 929.1555 937.1466 1050.8006 1065.0750 1078.5676 1127.3933 1140.9222 1150.0212 1161.1910 1209.4596 1255.1362 1276.8967 1316.0618 1364.6642 1374.6852 1382.7376 1443.8408 1450.9321 1453.3283 1458.2825 1484.3865 1486.4239 2876.4293 2893.6817 2970.9575 2973.2682 2977.8309 2982.8358 3069.9257 3073.5425 3095.9983 3099.4241
redmass: 6.7573 1.9447 2.1405 2.9814 2.1644 1.4049 1.5660 2.3585 12.0851 3.2432 3.8495 4.0328 5.7652 3.7154 9.2923 8.4434 1.1384 1.2527 2.1322 6.3877 2.3621 3.0140 1.7291 2.0408 2.1061 3.1075 2.7972 3.2542 9.4553 1.1622 1.1423 1.3459 1.2954 1.2584 1.3071 1.0817 1.0460 1.0454 1.0782 1.0512 1.0506 1.0654 1.0646 1.0645 1.0505 1.0603 1.0814 1.0965 1.0958 1.1005 1.1003
irintensity: 0.0061 0.4850 1.3906 4.0696 7.4530 4.2670 2.2738 4.3390 1.0187 8.2571 3.7892 15.1858 8.8068 0.3880 43.2652 3.3926 0.2052 11.6637 6.3333 81.1251 3.0117 19.6072 28.8578 2.1316 3.4467 85.8188 65.9138 107.4328 46.8380 0.0738 0.2847 19.6570 5.4276 29.8830 9.7212 0.5374 8.0904 4.5871 8.0003 6.8068 8.3935 48.9678 146.2639 83.9774 10.5091 52.8515 107.1611 47.8104 46.4070 24.5904 32.4858
temp: 298.150 k
press: 1.00000 atm
elementType: 8 8 7 7 7 6 6 6 6 1 1 1 1 1 1 1 1 1 1
symmnumber: 1
zpe: 387259.6 jmol-1
zpe.correction: 0.147499 hartree
zpe.thermalcorrener: 0.158586 hartree
zpe.thermalcorrenthalpy: 0.159530 hartree
zpe.thermalcorrgfe: 0.109328 hartree
zpe.sumelectzpe: -472.286275 hartree
zpe.sumelectthermal: -472.275188 hartree
zpe.sumelectthermalent: -472.274244 hartree
zpe.sumelectthermalfe: -472.324446 hartree
dipole: 0.9525 -6.3100 -1.5681
dipole: 6.5714
quadrupole: -59.4540 -70.7849 -71.4196
quadrupole: 3.0198 -2.4796 2.7189
quadrupole: 7.7655 -3.5654 -4.2001 3.0198 -2.4796 2.7189
hfenergy: -472.4337741 hartree
pointgroup: C01 [X(C4H10N3O2)]
dipole: 1.0233846 -2.2714792 -0.6908028 debye
dipolederiv: -0.5027574 0.1360891 -0.0914373 0.123433 -0.6166481 0.0058289 -0.2263263 0.1930046 -1.0722522 -0.4850012 0.2036004 -0.1329966 0.0835192 -0.507194 0.0509392 -0.5470561 0.8234115 -0.9774177 -0.440948 0.0591017 0.0337462 0.0615147 -0.5690215 -0.1262393 0.0329293 -0.1228872 -0.5397115 -0.1100311 -0.228003 -0.0306095 -0.2178552 0.3020013 0.3568541 0.1266507 0.1224731 0.9302131 0.0508042 -0.35619 0.1897304 -0.2445654 0.2413633 -0.1735133 0.5934153 -0.930438 0.4246416 0.4942784 -0.0911175 -0.0189052 -0.0446191 0.111614 -0.0127929 0.0295976 -0.1020705 0.291603 0.2173799 0.2045041 0.0164459 0.1688641 0.3782929 -0.0215948 0.049092 -0.0982006 0.2836179 0.0179225 -0.1161502 0.0357009 -0.099766 -0.0719387 -0.002755 0.0108063 0.0275048 0.0302086 -0.1421579 0.0458728 -0.0200791 0.0289242 0.0886395 -0.0278952 -0.025734 -0.0043854 0.0283654 -0.0570493 -0.0085887 -0.014977 0.0338658 -0.0009822 0.0910593 -0.1997522 0.1635094 -0.1162728 -0.0206894 0.0694513 0.041949 0.0662701 -0.1522677 -0.1371353 0.0672649 -0.1636044 -0.0433154 -0.0109322 0.0646119 0.068337 0.0762769 -0.1678195 -0.1251269 0.0712903 -0.1518926 -0.0368778 -0.0179847 0.0123303 -0.0634566 -0.0516261 -0.0378075 0.0732759 0.0145053 0.2455441 -0.1462976 0.0950144 0.030285 -0.075678 -0.0076474 0.0431597 0.0781309 0.0025871 0.0877304 -0.1135794 0.1303027 0.042956 0.0297945 0.0068973 -0.0339138 -0.0715692 -0.0061225 -0.1026399 -0.0064354 -0.2970241 0.017635 0.0119615 0.054865 0.0603604 0.0079895 -0.0055068 0.0084741 0.0929074 0.0679626 0.0567171 0.0282644 0.1089354 0.0208259 -0.0799104 0.0557843 -0.0756959 -0.0115849 0.0768491 0.0099284 -0.0171422 0.0504194 0.0792969 0.0901453 -0.0686307 0.0388129 -0.1080088 -0.0659386 -0.1530336 0.0093517 -0.1977058 -0.167961 0.0243094 0.0252055 0.0413496 0.0901966 unknown
polarizability: 80.7456279|-7.3564074|85.5765158|6.1983823|-6.3680703|77.1143249 unknown
InChI: InChI=1S/C4H10N3O2/c1-3-6(4-2)7(9)5-8/h3-4H2,1-2H3
charge -1 multiplicity 1
19 atoms
O  0.210912 0.176511 1.970262
O  -1.071911 1.769301 -0.963714
N  0.269872 -0.577155 -0.363649
N  -0.122637 0.458714 0.68844
N  -0.778868 1.616835 0.325966
C  1.732354 -0.824277 -0.218176
C  -0.525731 -1.809131 -0.094179
C  2.534897 0.449912 -0.527243
C  -2.024015 -1.556538 -0.329852
H  1.976582 -1.183784 0.810393
H  1.990776 -1.624906 -0.942765
H  -0.156047 -2.588069 -0.793956
H  -0.355437 -2.169332 0.950241
H  2.262137 0.839899 -1.523883
H  2.298391 1.227197 0.219516
H  3.62359 0.246155 -0.495707
H  -2.393722 -0.796001 0.37915
H  -2.18724 -1.165829 -1.349037
H  -2.605001 -2.489503 -0.188406
