program: Gaussian 09
title: 000107740
version: EM64L-G09RevD.01
frameworkgroup: C1[X(C6H11N5O)]
method: RPBEPBE
basis: SDD
operation: Freq
keyword: #p
keyword: freq=noraman
keyword: PBEPBE/SDD
title: #p freq=noraman PBEPBE/SDD
converged: YES YES NO NO
title: Mulliken charges:
elementType: O N N N N N C C C C C C H H H H H H H H H H H
charge: -0.202504 -0.393996 -0.470889 -0.092035 -0.078213 -0.626747 -0.017743 -0.710764 -0.670709 0.288765 0.220939 -0.087840 0.261821 0.283503 0.231018 0.196368 0.232589 0.268261 0.215061 0.188700 0.297053 0.309949 0.357413
chargesum: 0.00000
title: Mulliken charges with hydrogens summed into heavy atoms:
elementType: O N N N N N C C C C C C
charge: -0.202504 -0.110494 -0.173836 -0.092035 -0.078213 0.040615 0.244078 -0.050788 0.001313 0.288765 0.220939 -0.087840
polarizability: 1.37043044e+02 -2.12796646e+00 1.23097348e+02 -9.60326595e-01 -3.66424933e+00 6.27443358e+01
1716.lowfreq: -8.5891 -5.1010 -0.0002 0.0004 0.0005 4.2702 44.0675 58.8024 92.6571
frequency: 44.0191 58.7938 92.6532 118.4298 181.0209 194.3374 216.3740 224.8535 248.1632 268.8835 311.0512 343.6872 373.9687 420.4103 459.1470 510.6244 519.4765 541.3619 549.0479 590.8257 660.0933 687.8343 705.4798 759.6139 833.6200 867.0806 915.7268 925.4125 946.9509 959.3549 994.9149 1106.8921 1142.6248 1162.3141 1168.6541 1189.1076 1238.3623 1304.4870 1337.8704 1359.2755 1377.3976 1395.3817 1405.1437 1461.5261 1469.2484 1475.6903 1487.5846 1502.2306 1584.2351 1600.7904 1611.0546 1670.8197 2972.1683 2979.3221 3037.2263 3066.5973 3079.6951 3094.4494 3100.7389 3533.0592 3541.2176 3545.4004 3697.9091
redmass: 2.9329 3.9484 4.0292 4.2720 5.1047 7.5879 1.0537 1.1838 1.1435 2.5576 1.3670 2.9358 2.1285 3.0761 3.2910 1.3948 3.8735 2.4215 1.6587 5.5249 10.4761 5.8431 8.9023 11.9117 2.7015 7.5533 1.8670 1.6926 1.4390 2.4530 2.5396 2.3685 2.1164 2.4016 3.1954 3.1011 1.6492 1.4870 1.7690 1.6154 1.2151 1.2670 3.1678 1.0602 1.0513 1.1294 1.0495 1.8482 2.0132 5.4784 2.2251 5.9903 1.0391 1.0370 1.0855 1.0970 1.0978 1.0994 1.1000 1.0777 1.0762 1.0467 1.1049
irintensity: 3.7567 0.1958 3.6032 7.3795 0.3107 0.1953 5.5146 74.8208 0.0873 6.6419 10.7994 3.7435 10.3577 0.8048 7.3091 363.3388 70.4945 20.0395 18.4003 4.3295 1.2139 4.9398 8.2986 30.7967 4.1661 4.0098 8.4850 27.6164 7.2815 39.8046 11.2526 44.4723 50.0410 21.2378 146.4267 7.5686 144.0098 21.7717 2.5693 11.3139 26.2996 57.3991 125.3985 10.8883 7.3654 29.7221 19.7552 137.4765 245.3555 875.2202 639.0936 146.2604 26.1638 33.0138 1.3142 11.1612 56.7026 26.7077 22.1276 5.7385 36.8380 71.3283 41.4403
temp: 298.150 k
press: 1.00000 atm
elementType: 8 7 7 7 7 7 6 6 6 6 6 6 1 1 1 1 1 1 1 1 1 1 1
symmnumber: 1
zpe: 479832.2 jmol-1
zpe.correction: 0.182758 hartree
zpe.thermalcorrener: 0.195518 hartree
zpe.thermalcorrenthalpy: 0.196462 hartree
zpe.thermalcorrgfe: 0.143634 hartree
zpe.sumelectzpe: -583.318534 hartree
zpe.sumelectthermal: -583.305775 hartree
zpe.sumelectthermalent: -583.304830 hartree
zpe.sumelectthermalfe: -583.357658 hartree
dipole: 2.9993 -10.6630 1.0643
dipole: 11.1278
quadrupole: -63.3108 -72.5569 -72.9798
quadrupole: 17.3565 -2.7436 -0.1321
quadrupole: 6.3050 -2.9411 -3.3639 17.3565 -2.7436 -0.1321
hfenergy: -583.5012926 hartree
pointgroup: C01 [X(C6H11N5O1)]
dipole: 1.3618204 -4.1323144 0.4862979 debye
dipolederiv: -0.650222 0.1825916 -0.029382 0.277829 -1.2460627 0.134775 -0.0314855 0.116127 -0.3885774 -1.6089603 0.1555435 -0.0410107 0.308081 -0.3842305 -0.155709 0.13706 -0.1967777 -0.5027847 -1.3899234 -0.141318 0.0079552 -0.1477902 -0.6860581 0.0957929 0.033868 0.0985707 -0.2478189 -1.3800855 0.3480888 -0.0463932 0.7670751 -0.9699375 0.0786277 -0.1363895 0.0942378 -0.2788766 -0.8065819 -0.1923087 0.0316361 -0.4635122 -1.4723137 0.1372026 0.0992143 0.1738857 -0.3109213 -0.8705635 -0.6387089 0.0705036 -0.6495737 -0.9061895 -0.0363313 0.0226489 -0.0924338 -0.7245818 0.7477092 0.1141303 0.023842 0.4150021 0.2173712 0.1119976 -0.0961281 0.1247696 0.3234813 -0.1114405 -0.0013881 0.0448834 -0.0268481 0.0601218 -0.0781784 0.054455 -0.0785272 0.0354726 -0.113794 0.0190177 0.0223035 -0.083714 0.03783 -0.1043027 0.0295625 -0.1442935 -0.0921838 2.0383065 -0.0796667 0.0465808 -0.5572431 1.2053838 -0.0772756 0.0766338 -0.0566017 0.2153902 1.5600821 0.270701 -0.0804124 0.4299758 1.6945499 -0.1350643 -0.1372767 -0.1341239 0.2573418 1.7627169 -0.1093241 0.016159 -0.2324275 1.9495287 -0.2646845 0.0102722 -0.2725937 0.2739671 0.0527772 0.0434511 -0.0477215 -0.0343574 0.0072653 0.0499853 -0.0278629 0.0278931 -0.0118686 0.1460995 -0.016687 -0.0157564 -0.0829465 0.0943711 0.0534856 -0.0559439 0.1055995 0.2957847 -0.0961343 -0.07782 0.0236953 -0.1299734 -0.0024346 0.0204642 0.0072044 0.0023704 0.1103286 0.0627056 0.0297226 0.0005442 0.0958082 -0.0685689 0.0938898 -0.0473724 0.146583 -0.0254197 0.0980197 -0.0165199 -0.0576941 0.0168038 0.0405344 -0.1048189 -0.0265343 -0.0968683 -0.1208344 0.0122935 0.0886661 0.0914196 0.0847121 0.0549423 -0.0418429 0.0868017 -0.0242402 0.0511784 -0.0904088 -0.133074 -0.0075273 -0.1705841 0.0008463 0.0039233 -0.0137964 0.034625 0.0706181 0.0746621 0.0289919 -0.0608053 0.0802226 -0.0661818 0.1409432 -0.0507979 0.0666406 -0.0346548 0.1057795 0.0222663 0.0126707 0.0131331 0.079005 -0.0044044 0.0232765 -0.0307729 0.3435672 0.1828495 0.0578153 -0.0112941 0.055088 0.1823434 0.048384 0.0201307 0.097201 0.3760987 0.2741129 0.0458294 0.0058035 0.0352394 0.1778842 0.0331412 0.0224595 0.0387296 0.3852932 unknown
polarizability: 137.2131282|-1.4659423|122.826115|-0.0892673|-4.5162491|62.8454837 unknown
InChI: InChI=1S/C6H11N5O/c1-3(2)8-5-9-4(7)10-6(12)11-5/h3,8-9H,7H2,1-2H3
charge 0 multiplicity 1
23 atoms
O  -1.72107 2.500104 -0.368565
N  1.569284 -0.832943 -0.046132
N  -0.730727 -1.400315 0.024861
N  -0.034993 0.891964 -0.134004
N  -2.429626 0.295462 -0.011102
N  -3.030246 -1.959632 0.200363
C  2.713136 0.112218 -0.134032
C  3.92381 -0.626391 -0.735926
C  3.025468 0.742853 1.242262
C  0.264395 -0.392985 -0.047963
C  -2.072791 -0.972563 0.073248
C  -1.41238 1.296856 -0.19179
H  2.381896 0.918044 -0.812865
H  1.776879 -1.80251 0.200648
H  4.773585 0.069603 -0.84336
H  4.257802 -1.455462 -0.080286
H  3.687599 -1.038586 -1.733103
H  2.134865 1.268744 1.624795
H  3.844917 1.47852 1.148088
H  3.336063 -0.02707 1.974096
H  -0.49066 -2.389675 -0.055239
H  -2.812931 -2.925767 0.430559
H  -3.997773 -1.643067 0.209447
