program: Gaussian 09
title: 000107736
version: EM64L-G09RevD.01
frameworkgroup: C1[X(C15H22O)]
method: RPBEPBE
basis: SDD
operation: Freq
keyword: #pfreq=noraman
keyword: PBEPBE/SDD
title: #p freq=noraman PBEPBE/SDD
converged: YES YES NO NO
title: Mulliken charges:
elementType: O C C C C C C C C C C C C C C C H H H H H H H H H H H H H H H H H H H H H H
charge: -0.233223 0.144707 0.144698 0.360670 0.360684 -0.109096 -0.721105 -0.721180 -0.750123 -0.721126 -0.721142 -0.750130 -0.607089 -0.607076 0.661044 -0.734424 0.207017 0.203351 0.269222 0.269318 0.207013 0.203314 0.213502 0.213447 0.223826 0.207010 0.203335 0.269271 0.269249 0.207026 0.203330 0.213487 0.213465 0.223828 0.262318 0.262320 0.229631 0.229631
chargesum: 0.00000
title: Mulliken charges with hydrogens summed into heavy atoms:
elementType: O C C C C C C C C C C C C C C C
charge: -0.233223 0.144707 0.144698 0.360670 0.360684 -0.109096 -0.041515 -0.041535 -0.099348 -0.041511 -0.041537 -0.099350 -0.344771 -0.344755 0.661044 -0.275162
polarizability: 1.81984566e+02 2.00316579e-03 2.27268201e+02 -4.81901271e-04 -1.10642702e-05 1.14510464e+02
1716.lowfreq: -14.2006 -12.9606 -10.8078 0.0004 0.0005 0.0007 28.9635 64.5304 84.8937
frequency: 27.9049 64.4585 84.8192 147.3146 148.6624 157.2227 210.7778 213.7572 224.4478 252.8145 256.8498 264.5403 273.3043 280.3766 285.8451 303.6318 320.1484 322.4994 350.7665 361.1625 376.2459 387.6606 398.1885 422.0640 444.0078 460.6876 505.3547 547.5987 587.8909 627.2283 632.5417 661.7223 736.9798 783.3269 801.7685 836.3146 877.1249 904.8305 913.3395 924.7371 925.4640 928.7229 930.4258 944.1844 947.8362 948.1461 983.3645 993.3231 1020.9909 1027.1935 1029.3006 1030.8962 1078.4905 1171.1500 1199.9276 1200.7694 1214.0588 1217.0721 1256.9234 1260.1125 1316.1982 1354.8427 1365.4643 1366.0414 1370.1682 1372.0322 1395.3550 1395.5065 1397.3793 1431.7305 1454.3288 1454.7543 1468.5194 1471.7773 1475.8304 1476.9652 1478.2273 1478.4871 1490.9117 1492.2024 1504.2579 1507.1702 1515.4655 1585.3958 1587.4037 1648.3790 2970.1453 2970.2192 2975.8339 2976.0608 2979.1730 2979.7904 3061.8870 3062.0915 3065.7134 3066.0147 3066.0470 3066.2548 3076.4021 3076.8111 3098.1847 3111.1125 3111.2884 3114.0755 3114.3598 3138.4342 3142.5500 3203.7000
redmass: 3.5659 2.7403 3.6557 2.7278 3.6349 3.9021 1.1840 1.1178 2.8975 1.2583 1.3065 1.8967 2.7123 2.3731 2.4553 2.2865 1.0785 1.0577 4.6551 2.2576 2.2080 2.6005 3.0664 2.6968 3.5115 5.5116 2.8733 2.8589 4.0626 4.2935 3.3498 1.0349 4.9463 5.4220 3.2829 6.0316 2.4960 1.5316 1.5450 1.6474 1.5943 1.7322 1.6660 3.2828 1.2082 1.2098 1.5513 1.5100 1.5305 1.3910 1.3681 1.3866 2.4505 2.2937 2.9316 2.9316 2.6936 3.0880 2.4252 2.2952 1.7284 1.9125 1.1793 1.1792 1.2104 1.2334 1.2211 2.3109 1.7782 1.4614 1.0477 1.0479 1.2167 1.0555 1.0856 1.0483 1.0513 1.0479 1.0507 1.0511 1.4923 1.0595 1.7077 3.8659 8.0084 6.2760 1.0355 1.0355 1.0363 1.0364 1.0371 1.0371 1.1002 1.1002 1.0997 1.0993 1.0996 1.0993 1.0982 1.0980 1.0606 1.0984 1.0984 1.0979 1.0978 1.0904 1.0913 1.1150
irintensity: 0.6817 0.0000 3.3313 0.0000 0.1508 0.3343 0.0636 0.0000 1.9429 0.0389 0.0313 0.4762 2.7404 1.3287 0.0001 0.0272 0.0416 0.0000 11.8504 0.7731 0.0000 0.1763 3.0264 0.2331 0.4450 2.3929 0.5793 0.0234 0.0000 1.5458 2.8212 0.0000 4.0616 0.5371 0.2007 12.3774 48.9742 0.0000 0.0626 0.0000 3.3166 0.0156 18.3694 14.4010 0.0001 0.9609 87.0532 2.6692 17.2133 0.2487 0.0000 4.0682 26.6036 8.7338 0.0000 9.6547 0.0061 1.4518 86.6941 5.9091 22.1997 5.3898 0.0048 49.5953 92.2092 5.2128 10.6034 15.3881 16.5792 22.0456 0.0000 0.1161 83.7976 0.0842 17.9190 0.0077 3.8695 2.6669 0.0001 19.2635 66.6847 30.4278 6.8696 25.8952 33.5519 0.0953 11.7493 28.5733 0.0078 90.4182 75.2270 19.5024 0.0001 0.4190 0.0034 22.6904 112.5848 25.0658 84.4164 75.8047 2.8253 0.0014 1.0843 19.7789 12.0956 15.4492 2.1134 10.0385
temp: 298.150 k
press: 1.00000 atm
elementType: 8 6 6 6 6 6 6 6 6 6 6 6 6 6 6 6 1 1 1 1 1 1 1 1 1 1 1 1 1 1 1 1 1 1 1 1 1 1
symmnumber: 1
zpe: 861133.1 jmol-1
zpe.correction: 0.327988 hartree
zpe.thermalcorrener: 0.345585 hartree
zpe.thermalcorrenthalpy: 0.346529 hartree
zpe.thermalcorrgfe: 0.284632 hartree
zpe.sumelectzpe: -658.763709 hartree
zpe.sumelectthermal: -658.746112 hartree
zpe.sumelectthermalent: -658.745168 hartree
zpe.sumelectthermalfe: -658.807065 hartree
dipole: 0.0002 3.4214 0.0006
dipole: 3.4214
quadrupole: -91.3834 -95.6621 -101.8951
quadrupole: -0.0002 -0.0007 -0.0021
quadrupole: 4.9301 0.6514 -5.5815 -0.0002 -0.0007 -0.0021
hfenergy: -659.091697 hartree
pointgroup: C01 [X(C15H22O1)]
dipole: -0.0001064 -1.3460713 0.0002907 debye
polarizability: 181.9844572|0.0025194|227.2682012|0.0857679|-0.0039043|114.5105727 unknown
InChI: InChI=1S/C15H22O/c1-10-8-11(14(2,3)4)13(16)12(9-10)15(5,6)7/h8-9H,1H2,2-7H3
charge 0 multiplicity 1
38 atoms
O  0.000116 1.896622 -0.000319
C  2.630929 0.636451 0.003407
C  -2.630847 0.636548 -0.003233
C  1.298621 -0.144881 0.001877
C  -1.298552 -0.14481 -0.00151
C  0.000059 0.614046 0.00026
C  2.718273 1.531423 1.27935
C  2.720553 1.53212 -1.271865
C  3.856449 -0.316194 0.004293
C  -2.717817 1.531768 -1.279029
C  -2.720889 1.531947 1.272204
C  -3.856347 -0.316116 -0.00467
C  1.253955 -1.520434 0.001751
C  -1.253955 -1.520364 -0.001448
C  -0.000021 -2.27243 0.000152
C  -0.000061 -3.65054 0.000117
H  2.670147 0.915847 2.197242
H  3.681173 2.076151 1.281888
H  1.898895 2.266212 1.299805
H  1.901462 2.267224 -1.293151
H  2.673618 0.917129 -2.190201
H  3.683633 2.076545 -1.272603
H  3.881722 -0.960459 -0.894881
H  3.879587 -0.961523 0.902761
H  4.780809 0.289035 0.005728
H  -2.669392 0.916375 -2.197028
H  -3.680727 2.076477 -1.281758
H  -1.898455 2.266588 -1.299088
H  -1.901903 2.267153 1.293844
H  -2.674103 0.91677 2.190424
H  -3.684044 2.076244 1.272823
H  -3.881818 -0.960626 0.894323
H  -3.87926 -0.961204 -0.903317
H  -4.780718 0.289096 -0.006163
H  2.17928 -2.105926 0.002912
H  -2.179315 -2.105806 -0.002699
H  -0.934161 -4.223901 -0.001115
H  0.934006 -4.223955 0.001318
