program: Gaussian 09
title: 000107731
version: EM64L-G09RevD.01
frameworkgroup: C1[X(C14H12O3)]
method: RPBEPBE
basis: SDD
operation: Freq
keyword: #pfreq=noraman
keyword: PBEPBE/SDD
title: #p freq=noraman PBEPBE/SDD
converged: NO NO NO NO
title: Mulliken charges:
elementType: O O O C C C C C C C C C C C C C C H H H H H H H H H H H H
charge: -0.231036 -0.243371 -0.203125 -0.000093 0.032755 0.307769 -0.025985 0.407641 0.298018 -0.554879 0.356257 -0.322075 -0.820930 -0.775655 -0.479060 -0.809229 0.119104 0.250738 0.274146 0.259013 0.232966 0.233010 0.217863 0.250074 0.250133 0.252658 0.240967 0.241362 0.240964
chargesum: 0.00000
title: Mulliken charges with hydrogens summed into heavy atoms:
elementType: O O O C C C C C C C C C C C C C C
charge: -0.231036 -0.243371 -0.203125 -0.000093 0.032755 0.307769 -0.025985 0.407641 0.298018 -0.304141 0.356257 -0.047929 -0.095942 -0.057585 -0.226402 -0.085935 0.119104
polarizability: 2.34353936e+02 -7.90833413e+00 1.98042513e+02 -8.61639856e-03 -2.32041690e-02 7.64614460e+01
1716.lowfreq: -94.5929 -13.3411 -8.5965 -4.1083 -0.0013 -0.0009 -0.0005 57.2803 93.6685
frequency: -94.5823 57.2594 93.6622 115.7567 133.5551 150.9054 163.8680 180.1367 206.5883 217.9226 261.5778 275.9277 299.8841 308.0442 384.3730 385.5403 398.6673 477.0878 517.5785 526.6190 541.6379 545.1972 566.6467 616.6290 637.9417 651.4711 689.4099 704.0074 749.9445 768.4191 775.8234 780.8465 865.3726 882.6584 887.0352 928.0249 996.2927 1002.0814 1014.3574 1037.4151 1044.1038 1045.4872 1045.5705 1061.9269 1114.9962 1156.2401 1205.7339 1208.9545 1247.3764 1278.5395 1319.0116 1375.2113 1394.6543 1398.0504 1402.6925 1412.6962 1431.0597 1460.8661 1465.7453 1466.2943 1468.6666 1471.2954 1478.0535 1484.0634 1580.1724 1590.7255 1608.6801 1623.6559 1688.1653 2982.3111 2987.9097 2994.0968 3059.3693 3064.9161 3077.6816 3097.1412 3103.8445 3107.0871 3148.0033 3172.1283 3256.7824
redmass: 1.0164 4.5881 3.5859 3.4027 1.1693 4.2304 1.7692 3.7971 1.6875 2.8639 4.9105 3.4199 4.0499 4.5369 4.9565 5.1423 8.8153 5.2665 5.5187 3.9337 4.0965 4.5192 6.2330 3.6746 4.1468 5.2929 6.2779 5.1872 8.7012 1.8643 7.4474 2.8065 1.3759 1.4120 5.7893 5.3231 1.7453 1.5750 1.8823 2.8722 1.4914 1.5586 1.5124 6.6402 4.4936 3.5374 3.2008 2.0375 1.4319 2.0894 3.1932 4.5061 1.3217 1.2986 3.3621 1.3337 4.4742 1.0423 1.3409 1.0462 1.1592 1.3586 1.0458 2.0663 5.5664 6.3491 8.5895 8.0265 10.4652 1.0380 1.0380 1.0366 1.0969 1.0980 1.0976 1.1005 1.0986 1.0982 1.0907 1.0918 1.1003
irintensity: 0.1522 3.6757 0.1419 4.3362 0.0001 2.6584 0.2976 0.5366 2.7805 1.0730 0.0824 0.3997 0.2317 0.0116 0.0669 3.3274 6.3748 8.2262 4.2928 1.5731 8.3024 3.1113 5.9947 8.3056 13.3901 1.3851 8.9752 1.4932 38.7776 29.5923 2.9919 5.2998 1.3386 40.8245 33.9247 35.6530 3.9398 6.6655 15.9282 26.8805 1.1360 16.9448 2.4659 71.6740 9.1493 19.6448 5.5586 5.8793 11.3381 15.0380 24.6280 59.6087 16.3061 9.2048 52.2418 11.5666 43.0998 14.6470 0.0829 16.1762 26.0356 1.5762 16.3998 33.1530 23.3464 14.2070 106.6450 9.1987 564.3802 12.5010 31.8836 20.5654 12.1662 16.7433 11.3983 22.9369 22.4217 5.6328 7.2773 2.3983 0.5017
temp: 298.150 k
press: 1.00000 atm
elementType: 8 8 8 6 6 6 6 6 6 6 6 6 6 6 6 6 6 1 1 1 1 1 1 1 1 1 1 1 1
symmnumber: 1
zpe: 582438.6 jmol-1
zpe.correction: 0.221839 hartree
zpe.thermalcorrener: 0.236192 hartree
zpe.thermalcorrenthalpy: 0.237136 hartree
zpe.thermalcorrgfe: 0.181200 hartree
zpe.sumelectzpe: -765.175091 hartree
zpe.sumelectthermal: -765.160738 hartree
zpe.sumelectthermalent: -765.159794 hartree
zpe.sumelectthermalfe: -765.215730 hartree
dipole: -2.1570 4.4534 -0.0073
dipole: 4.9482
quadrupole: -99.7209 -92.5335 -100.5795
quadrupole: 19.0645 -0.0243 0.0220
quadrupole: -2.1096 5.0778 -2.9682 19.0645 -0.0243 0.0220
hfenergy: -765.3969305 hartree
pointgroup: C01 [X(C14H12O3)]
dipole: -0.8352405 -1.7585091 0.0028628 debye
polarizability: 234.2312254|8.1842824|198.1652233|0.0087931|-0.0231378|76.461446 unknown
InChI: InChI=1S/C14H12O3/c1-7-5-11(15)17-14-10(7)4-8(2)13-12(14)9(3)6-16-13/h4-6H,1-3H3
charge 0 multiplicity 1
29 atoms
O  -3.241803 -0.078338 -0.000483
O  1.213109 1.457369 0.001086
O  3.351842 2.328612 -0.003023
C  -1.035623 0.603916 0.000101
C  0.35708 0.356401 0.000679
C  0.837908 -0.987081 0.001148
C  -1.905148 -0.51889 0.000057
C  -1.497868 -1.872199 0.000397
C  -1.869541 1.802982 -0.00035
C  -0.104018 -2.067866 0.000819
C  2.284934 -1.190811 0.000718
C  -3.171151 1.345117 -0.000693
C  -2.497794 -3.011096 0.000162
C  -1.408727 3.23511 -0.000435
C  3.127353 -0.092496 0.001398
C  2.859305 -2.590506 -0.001117
C  2.667065 1.287163 0.004924
H  0.276191 -3.094763 0.000789
H  -4.13361 1.849359 -0.001087
H  -3.531466 -2.631164 -0.001129
H  -2.369686 -3.653966 -0.889766
H  -2.371517 -3.652735 0.891247
H  -2.264468 3.931132 -0.000583
H  -0.782421 3.449057 0.883455
H  -0.782258 3.448904 -0.88425
H  4.213628 -0.216857 -0.000316
H  2.527235 -3.156588 -0.891508
H  3.960526 -2.566585 -0.001478
H  2.527825 -3.158881 0.88804
