program: Gaussian 09
title: 000107712
version: EM64L-G09RevD.01
frameworkgroup: C1[X(C4H7NOS)]
method: RPBEPBE
basis: SDD
operation: Freq
keyword: #p
keyword: freq=noraman
keyword: PBEPBE/SDD
title: #p freq=noraman PBEPBE/SDD
converged: NO YES NO NO
title: Mulliken charges:
elementType: S O N C C C C H H H H H H H
charge: 0.223140 -0.162738 -0.623091 -0.070164 -0.380728 -0.688322 -0.143081 0.231476 0.229588 0.254055 0.275634 0.268952 0.274383 0.310895
chargesum: 0.00000
title: Mulliken charges with hydrogens summed into heavy atoms:
elementType: S O N C C C C
charge: 0.223140 -0.162738 -0.037813 0.161312 0.102915 -0.143736 -0.143081
polarizability: 8.24027321e+01 5.33452722e+00 7.34670824e+01 3.08794559e-01 -2.59110625e+00 4.30057481e+01
1716.lowfreq: -20.4346 -12.9153 -0.0037 -0.0017 -0.0014 4.8601 102.4837 189.3126 197.3715
frequency: 102.4817 189.3065 197.3636 277.5814 369.4557 395.8773 437.7480 499.2214 562.9797 596.3373 631.6949 698.2696 841.3257 892.2494 963.2297 1000.3750 1035.8980 1106.7051 1128.5266 1158.9698 1193.0662 1269.8230 1284.9098 1315.7743 1339.1258 1453.0498 1460.2457 1614.3881 1661.5253 2832.3251 3014.1049 3040.3252 3083.9758 3125.7731 3475.5220 3614.7862
redmass: 5.4550 1.3913 1.4404 4.2274 3.0556 10.3668 7.3936 4.3392 1.4699 3.3126 4.1842 3.7811 1.5104 3.3112 2.5475 1.7498 1.9480 1.1876 1.6391 1.3175 1.9874 1.2270 1.2831 1.6008 1.6035 1.0829 1.0937 1.5521 2.8724 1.0786 1.0599 1.0608 1.1031 1.1075 1.0463 1.0978
irintensity: 0.8911 18.8808 13.1725 7.6009 5.5655 9.8791 3.6356 1.8850 216.2489 51.9877 4.7164 15.1708 10.9844 86.0670 51.2615 3.1238 10.9173 3.5530 2.5392 1.1503 1.4870 9.4837 1.3535 0.5554 18.0794 12.5724 6.0196 256.6492 122.3905 60.5613 22.1529 23.3708 17.0399 13.9717 6.6444 13.0554
temp: 298.150 k
press: 1.00000 atm
elementType: 16 8 7 6 6 6 6 1 1 1 1 1 1 1
symmnumber: 1
zpe: 286292.2 jmol-1
zpe.correction: 0.109043 hartree
zpe.thermalcorrener: 0.116329 hartree
zpe.thermalcorrenthalpy: 0.117274 hartree
zpe.thermalcorrgfe: 0.077501 hartree
zpe.sumelectzpe: -684.107776 hartree
zpe.sumelectthermal: -684.100489 hartree
zpe.sumelectthermalent: -684.099545 hartree
zpe.sumelectthermalfe: -684.139318 hartree
dipole: 0.2021 -4.0750 1.5205
dipole: 4.3541
quadrupole: -45.9309 -52.1577 -49.7959
quadrupole: 0.3187 2.6815 -1.4439
quadrupole: 3.3639 -2.8629 -0.5011 0.3187 2.6815 -1.4439
hfenergy: -684.2168186 hartree
pointgroup: C01 [X(C4H7N1O1S1)]
dipole: -0.6860237 1.445476 -0.611937 debye
dipolederiv: -0.7837231 -0.0783521 0.0453973 -0.2596504 -0.1650387 0.0165751 0.05954 -0.0070481 -0.0797552 -1.2333341 0.1955361 0.0126201 0.3961664 -0.5398322 0.0246352 -0.0543257 0.0487285 -0.2704723 -0.5795067 -0.0965111 0.0013177 -0.2073311 -0.369145 -0.1894804 -0.0450914 -0.2078209 -0.6933074 0.4066105 0.1780551 0.1204906 0.145247 -0.0953173 0.1730222 0.0470144 0.2149934 0.4306998 -0.1356027 -0.0233097 0.026975 0.0202743 -0.0190565 -0.0453528 0.0340865 0.0485396 0.068122 0.0932122 -0.1608991 0.0112964 -0.1942852 0.2503533 -0.0473287 0.0270855 -0.041793 0.1445932 1.8252662 0.011931 -0.0896193 -0.1206558 0.6442442 -0.1288201 -0.0393219 -0.1885385 0.0832389 -0.0254945 -0.0326441 -0.0699774 -0.0383377 -0.003097 -0.0258932 -0.062138 -0.058548 -0.2092101 0.0962542 0.0197732 -0.0117083 0.0570487 -0.1484659 0.0514104 -0.0190201 0.0596788 0.0775727 0.0599558 -0.0149517 -0.0311094 -0.0007748 0.09438 0.0118019 -0.0025013 -0.0407735 -0.1021228 -0.0605731 0.0233492 0.0735265 0.0459296 0.042688 0.0008246 0.0935429 -0.0017839 0.0472944 0.0444788 0.0205702 -0.0400877 0.0672295 -0.0159077 0.0430275 -0.0998891 0.0229733 -0.1034374 0.1553759 -0.055144 -0.0438714 -0.0396917 0.1289903 0.1096967 -0.0099873 0.1494897 0.2708156 0.1370805 0.012597 -0.0052499 0.1288311 0.1952047 0.0058815 0.0710053 0.0019027 0.3359685 unknown
polarizability: 84.873013|0.6797055|70.936291|0.5045222|-2.8397292|43.0662586 unknown
InChI: InChI=1S/C4H7NOS/c5-3-1-2-7-4(3)6/h3H,1-2,5H2
charge 0 multiplicity 1
14 atoms
S  -1.20911 -1.433052 0.079967
O  1.548863 -1.403807 -0.001562
N  1.648954 1.420348 0.115563
C  0.441991 0.779155 -0.395331
C  -0.877544 1.296797 0.221319
C  -1.986879 0.289116 -0.146807
C  0.501681 -0.737074 -0.101154
H  0.34085 0.837637 -1.511956
H  -1.129849 2.306809 -0.149473
H  -0.743703 1.352138 1.316135
H  -2.861714 0.350788 0.516603
H  -2.306121 0.378679 -1.198189
H  1.87781 2.323931 -0.301067
H  2.44937 0.786437 0.205452
