program: Gaussian 09
title: 000107733
version: EM64L-G09RevD.01
frameworkgroup: C1[X(C8H15N2O5P)]
method: RPBEPBE
basis: SDD
operation: Freq
keyword: #p
keyword: freq=noraman
keyword: PBEPBE/SDD
title: #p freq=noraman PBEPBE/SDD
converged: YES YES NO NO
title: Mulliken charges:
elementType: P O O O O O N N C C C C C C C C H H H H H H H H H H H H H H H
charge: 1.247896 -0.411643 -0.228386 -0.671982 -0.669221 -0.627316 -0.083324 -0.299829 -0.381870 -0.163570 -0.323820 -0.460529 -0.410567 0.136128 -0.032403 -0.618851 0.183991 0.241023 0.268318 0.219868 0.181041 0.222155 0.223360 0.286024 0.231948 0.204984 0.294191 0.279147 0.383289 0.393472 0.386472
chargesum: 0.00000
title: Mulliken charges with hydrogens summed into heavy atoms:
elementType: P O O O O O N N C C C C C C C C
charge: 1.247896 -0.028354 -0.228386 -0.278510 -0.282749 -0.627316 -0.083324 -0.013804 0.043143 0.104748 0.077090 -0.015014 0.026366 0.136128 0.261789 -0.339704
polarizability: 1.91708596e+02 -8.11233608e+00 1.22308224e+02 1.28021555e+00 -1.11683895e+00 1.11219430e+02
1716.lowfreq: -3.7615 -0.0015 -0.0010 -0.0002 7.0971 13.3205 21.1941 27.6161 39.6532
frequency: 20.2992 27.2683 39.3476 50.7545 92.5192 96.9660 107.5449 119.3027 140.7346 167.7335 213.0254 225.7528 252.4734 269.1589 290.3193 311.4375 329.3226 341.1816 348.0817 363.6650 377.6092 391.4649 457.0805 484.1422 503.2284 556.3510 578.0332 610.0811 615.3041 667.0784 693.7110 712.8388 763.1663 771.6769 814.5811 852.9614 908.5838 921.1229 963.4300 981.0851 983.8931 1004.4464 1014.7459 1018.4455 1033.3400 1059.8901 1066.2284 1089.1506 1098.9637 1130.5910 1148.0727 1167.5458 1199.7019 1201.4492 1228.9783 1251.8657 1274.8054 1275.8665 1296.1047 1312.3546 1322.3475 1346.9667 1349.0687 1361.3222 1378.0585 1444.7440 1448.6286 1451.2173 1462.3250 1468.3010 1647.4219 1661.3916 2839.2556 2847.2851 2870.9294 2989.9348 2993.1369 3017.6194 3036.5756 3044.7211 3070.0265 3108.1786 3154.8168 3467.0860 3513.5551 3584.1796 3602.3008
redmass: 6.5073 6.4037 7.1549 7.4418 5.4809 4.5612 3.8054 3.3292 2.9712 2.2883 3.0446 3.4940 2.7034 2.1123 1.5152 3.3020 3.7426 2.8784 3.4533 3.8438 4.3220 2.1831 5.6135 3.1941 4.0554 1.6400 1.7490 1.4535 3.1206 10.1071 3.5553 6.2718 3.6346 2.4365 2.1070 2.5921 2.4921 2.3048 1.8914 1.9919 1.7098 1.9824 1.2597 1.5123 2.7386 2.2128 2.6662 2.8348 2.6713 2.8354 2.1723 1.7050 1.3828 1.4188 1.4360 1.4856 1.3498 1.2437 1.5053 1.4245 1.2176 1.4885 1.5425 1.2742 1.4126 1.1124 1.0869 1.1664 1.1345 1.1059 6.8545 8.6741 1.0703 1.0694 1.0685 1.0876 1.0637 1.0835 1.0883 1.0906 1.1015 1.0920 1.0925 1.0752 1.0640 1.0661 1.0661
irintensity: 0.3285 0.4865 0.6146 0.4280 18.4548 0.9655 24.2147 4.7644 32.1155 19.1095 1.5801 8.9586 11.2154 44.3232 88.0870 4.6040 17.8435 28.8920 60.9163 51.1476 50.8655 11.7102 8.4302 29.1624 0.2380 39.4470 39.6909 199.6609 47.7926 151.3132 64.3623 173.3457 60.1033 96.6957 26.5807 6.4393 16.3023 5.9853 19.2655 39.5252 12.7380 23.2522 80.9286 71.8381 10.4755 208.5531 70.5571 37.6286 87.4556 10.4121 19.2110 23.8330 28.0945 27.9921 1.0841 5.2678 11.6232 4.4662 8.9498 17.9156 54.7915 12.8760 26.7302 23.3102 2.8205 2.7909 6.0518 20.0208 1.6270 13.3306 26.9959 231.4506 41.9287 83.9381 125.5865 17.2250 37.8672 12.5962 46.5204 26.8572 32.7553 0.3693 3.3835 10.7181 28.3819 58.8945 53.1517
temp: 298.150 k
press: 1.00000 atm
elementType: 15 8 8 8 8 8 7 7 6 6 6 6 6 6 6 6 1 1 1 1 1 1 1 1 1 1 1 1 1 1 1
symmnumber: 1
zpe: 626653.3 jmol-1
zpe.correction: 0.238680 hartree
zpe.thermalcorrener: 0.256890 hartree
zpe.thermalcorrenthalpy: 0.257834 hartree
zpe.thermalcorrgfe: 0.190251 hartree
zpe.sumelectzpe: -1139.390062 hartree
zpe.sumelectthermal: -1139.371852 hartree
zpe.sumelectthermalent: -1139.370908 hartree
zpe.sumelectthermalfe: -1139.438491 hartree
dipole: 0.1062 -0.5574 -2.1617
dipole: 2.2349
quadrupole: -105.3374 -96.1989 -112.1943
quadrupole: -15.1077 4.3732 0.9278
quadrupole: -0.7606 8.3780 -7.6174 -15.1077 4.3732 0.9278
hfenergy: -1139.628742 hartree
pointgroup: C01 [X(C8H15N2O5P1)]
dipole: 0.0644739 -0.2826215 -0.830138 debye
polarizability: 192.0962403|-5.5371705|121.6021527|3.2227504|-1.9756366|111.5378573 unknown
InChI: InChI=1S/C8H15N2O5P/c11-8(12)7-6-10(4-2-9-7)3-1-5-16(13,14)15/h1,5,7,9,11,13-14H,2-4,6H2
charge 0 multiplicity 1
31 atoms
P  -4.533138 -0.321443 0.147941
O  4.718072 -1.527885 0.951075
O  5.214274 0.110434 -0.621326
O  -5.489588 -1.616893 -0.468814
O  -5.209541 1.012508 -0.758584
O  -4.532856 -0.05423 1.719767
N  0.620263 -0.228991 -0.002609
N  2.921015 1.540537 0.120865
C  1.976407 -0.790603 -0.207459
C  3.021313 0.128738 0.514115
C  0.51458 1.155443 -0.534287
C  1.542425 2.061803 0.185694
C  -0.4452 -1.128151 -0.499456
C  4.420313 -0.379839 0.210829
C  -1.795774 -0.760168 0.075648
C  -2.941348 -0.716363 -0.646958
H  2.242799 -0.857498 -1.294853
H  2.017168 -1.805812 0.226891
H  2.83176 0.031905 1.599583
H  -0.510216 1.527162 -0.350885
H  0.695315 1.17829 -1.641015
H  1.526292 3.07771 -0.246869
H  1.245525 2.141013 1.249272
H  3.427106 1.740561 -0.751343
H  -0.200766 -2.154197 -0.154216
H  -0.499327 -1.165454 -1.616094
H  -1.811198 -0.548598 1.155047
H  -2.98098 -0.909307 -1.724618
H  5.624431 -1.857766 0.703417
H  -6.456731 -1.565772 -0.261996
H  -5.358695 1.814964 -0.194861
