program: Gaussian 09
title: 000107734
version: EM64L-G09RevD.01
frameworkgroup: C1[X(C10H10Cl8)]
method: RPBEPBE
basis: SDD
operation: Freq
keyword: #p
keyword: freq=noraman
keyword: PBEPBE/SDD
title: #p freq=noraman PBEPBE/SDD
converged: YES YES NO NO
title: Mulliken charges:
elementType: Cl Cl Cl Cl Cl Cl Cl Cl C C C C C C C C C C H H H H H H H H H H
charge: 0.024530 0.024312 -0.005413 0.001449 0.058924 0.061033 0.041598 0.045102 0.544755 0.379603 -0.172389 -0.482049 -0.564341 -0.476677 -0.417390 -0.791060 -0.745426 -0.759236 0.344962 0.346440 0.354819 0.368933 0.349070 0.340228 0.363511 0.257216 0.264187 0.243308
chargesum: 0.00000
title: Mulliken charges with hydrogens summed into heavy atoms:
elementType: Cl Cl Cl Cl Cl Cl Cl Cl C C C C C C C C C C
charge: 0.024530 0.024312 -0.005413 0.001449 0.058924 0.061033 0.041598 0.045102 0.544755 0.379603 0.172573 -0.135609 -0.209522 -0.107744 -0.068319 -0.450832 -0.381915 0.005475
polarizability: 1.89716556e+02 -1.56866959e-01 1.81025541e+02 6.28433088e+00 8.43619535e+00 1.54906417e+02
1716.lowfreq: -14.3865 -10.6490 -4.6294 -0.0025 0.0016 0.0024 47.3149 64.9528 69.6590
frequency: 47.2579 64.9368 69.6234 88.2243 99.1869 108.7321 121.8067 131.0091 145.0537 154.2918 158.3400 186.6516 195.2585 206.7342 221.8798 240.9565 263.5973 276.9746 280.7135 298.8489 304.1874 309.4787 345.2988 371.4983 425.8038 483.9410 518.3591 552.2737 573.0997 643.5506 663.2741 688.5075 698.5599 700.8505 713.4769 747.9253 761.8205 791.9761 849.2790 871.4429 927.7232 934.5370 958.2158 971.4747 998.2565 1045.1527 1067.8702 1088.9970 1117.3201 1148.0895 1172.1694 1177.9225 1187.7788 1197.7841 1199.2689 1207.6988 1227.3942 1243.5271 1267.8930 1271.4756 1275.9691 1289.5285 1291.1784 1308.2975 1314.1840 1408.3008 1472.3362 1489.7095 3009.5696 3083.6489 3096.3255 3106.7927 3108.7747 3117.3705 3120.7176 3123.1019 3127.7371 3141.2901
redmass: 23.8372 22.8000 23.1455 21.5395 25.7016 19.5405 24.1869 22.4364 22.0462 19.9386 21.8888 21.9956 16.6338 15.4409 13.9393 1.8740 9.8848 6.4906 1.9081 4.5721 8.8174 8.5510 5.1512 5.3784 6.0584 4.3874 6.8428 5.3329 6.0133 5.9197 6.6198 6.9716 7.3322 6.7952 7.0128 6.2482 6.4626 5.8705 3.9264 4.1621 2.3833 2.7934 3.2706 3.8422 4.0158 3.3908 3.5303 2.3943 2.1562 1.8557 1.6400 1.4705 1.3116 1.3153 1.1969 1.2453 1.5753 1.2508 1.2160 1.2723 1.2825 1.2811 1.2586 1.2859 1.3422 1.1671 1.0484 1.0448 1.0382 1.0876 1.0869 1.0978 1.0867 1.0898 1.0880 1.0934 1.0950 1.0890
irintensity: 0.0781 0.4193 0.7181 0.2704 0.3886 0.2500 0.5901 1.0907 0.6622 1.8357 1.4207 1.5799 1.0812 1.4948 1.3124 0.2503 0.4887 6.7548 1.1664 2.9270 0.2167 4.9673 4.8011 7.2315 15.8026 23.1014 28.0613 25.7689 16.2505 3.3613 18.3536 2.4828 51.9161 23.8614 37.3929 49.5778 55.8586 31.3936 62.5804 24.9891 8.0231 38.3599 7.7890 11.3378 8.8353 5.0119 14.4567 13.1915 1.0072 10.9939 0.4130 0.5851 9.4004 1.9406 8.2993 4.2667 2.3016 6.7247 5.1670 10.2220 9.1776 0.4934 4.3953 9.0399 13.7184 24.3719 8.4991 14.4612 11.6314 2.6315 2.8961 5.0239 4.5798 0.7007 0.8537 1.0657 0.2643 8.1013
temp: 298.150 k
press: 1.00000 atm
elementType: 17 17 17 17 17 17 17 17 6 6 6 6 6 6 6 6 6 6 1 1 1 1 1 1 1 1 1 1
symmnumber: 1
zpe: 476532.8 jmol-1
zpe.correction: 0.181502 hartree
zpe.thermalcorrener: 0.201095 hartree
zpe.thermalcorrenthalpy: 0.202039 hartree
zpe.thermalcorrgfe: 0.132785 hartree
zpe.sumelectzpe: -4066.139705 hartree
zpe.sumelectthermal: -4066.120112 hartree
zpe.sumelectthermalent: -4066.119168 hartree
zpe.sumelectthermalfe: -4066.188422 hartree
dipole: -1.5633 0.3487 -0.6464
dipole: 1.7272
quadrupole: -175.6796 -171.0269 -160.5162
quadrupole: 0.4329 1.9400 -1.2515
quadrupole: -6.6054 -1.9527 8.5580 0.4329 1.9400 -1.2515
hfenergy: -4066.3212071 hartree
pointgroup: C01 [X(C10H10Cl8)]
dipole: -0.624904 -0.1175465 0.239696 debye
polarizability: 190.0046794|-0.3588406|181.2047637|-5.148227|8.317227|154.4390707 unknown
InChI: InChI=1S/C10H10Cl8/c1-9(7(15)16)2-3(11)5(13)10(9,8(17)18)6(14)4(2)12/h2-8H,1H3
charge 0 multiplicity 1
28 atoms
Cl 2.678425 0.015459 1.841123
Cl 1.271872 -1.667296 -2.433674
Cl 0.549366 -3.292355 1.585876
Cl -2.580283 -1.801852 -1.573004
Cl 3.034488 0.99584 -1.573965
Cl 1.682417 2.883014 0.349894
Cl -1.617367 2.907353 -0.803772
Cl -3.508429 1.116786 0.767644
C  0.621994 0.272005 -0.27154
C  -0.7658 0.52281 0.555011
C  -1.019933 -1.033356 0.734858
C  1.403807 -0.721066 0.669293
C  0.040053 -0.659326 -1.42627
C  0.284936 -1.429858 1.472566
C  -0.916924 -1.627285 -0.686238
C  1.375887 1.480296 -0.850262
C  -1.933982 1.141368 -0.255373
C  -0.614952 1.267811 1.90565
H  -1.933408 -1.300105 1.282377
H  2.002838 -1.413984 0.060933
H  -0.466942 -0.050131 -2.18966
H  0.262099 -1.110684 2.5215
H  -0.540874 -2.658942 -0.671272
H  0.820528 1.94507 -1.674705
H  -2.217011 0.608139 -1.168635
H  0.383369 1.142474 2.349098
H  -0.773912 2.348693 1.770048
H  -1.375263 0.897123 2.615099
