program: Gaussian 09
title: 000008804
version: EM64L-G09RevD.01
frameworkgroup: C1[X(C10H11N3O5)]
method: RPBEPBE
basis: SDD
operation: Freq
keyword: #p
keyword: freq=noraman
keyword: PBEPBE/SDD
title: #p freq=noraman PBEPBE/SDD
converged: YES YES NO NO
title: Mulliken charges:
elementType: O O O O O N N N C C C C C C C C C C H H H H H H H H H H H
charge: -0.292198 -0.399556 -0.270101 -0.224889 -0.219748 -0.425228 -0.483963 0.018930 -0.373771 -0.467302 0.497214 0.288577 -0.424425 -0.308312 0.389406 -0.347380 -0.363572 0.221601 0.236443 0.272829 0.274140 0.259756 0.337983 0.302451 0.228274 0.318092 0.285789 0.284808 0.384152
chargesum: 0.00000
title: Mulliken charges with hydrogens summed into heavy atoms:
elementType: O O O O O N N N C C C C C C C C C C
charge: -0.292198 -0.015404 -0.270101 -0.224889 -0.219748 -0.087245 -0.181512 0.018930 0.135501 0.066594 0.497214 0.288577 -0.196151 0.009780 0.389406 -0.061591 -0.078764 0.221601
polarizability: 2.86667925e+02 5.50244306e+00 1.45536436e+02 -1.15978092e+01 1.18715100e+01 7.73976068e+01
1716.lowfreq: -4.2047 -0.0008 -0.0007 -0.0001 4.3086 8.3924 15.1847 34.8667 42.2187
frequency: 14.7890 34.8011 42.2116 55.5192 71.5842 84.6392 96.1095 113.4240 145.2275 203.7466 232.1533 238.6512 298.8616 304.9820 330.0666 373.2076 417.3228 454.5328 463.4862 490.5275 508.7436 510.4852 542.5788 613.9241 620.2769 643.3679 664.2398 666.6016 672.3409 709.2023 715.2370 736.3339 772.0787 801.7647 829.5552 831.7351 870.8594 878.8231 973.0888 976.9888 997.5055 1007.3599 1010.3592 1060.1401 1064.3025 1097.2022 1118.2158 1128.4999 1177.6297 1195.6793 1215.0595 1227.0593 1246.5895 1279.8789 1283.5812 1301.3402 1349.6200 1356.3715 1373.4320 1387.5936 1428.7466 1432.8810 1467.4810 1486.2116 1491.2412 1512.7780 1594.1835 1616.3400 1643.6983 1651.6420 3000.4346 3007.8575 3071.4205 3089.2050 3124.1268 3177.4579 3184.4739 3199.9729 3500.8682 3508.2386 3521.6036
redmass: 6.8219 6.8636 9.0439 7.4081 8.9920 5.3757 5.2851 5.5504 4.7170 8.2951 3.9877 6.4881 4.9420 4.1001 6.0266 5.5400 3.0267 5.6076 1.9868 2.1561 5.0935 3.3221 1.5958 2.2661 6.3212 7.2957 1.7676 2.8281 1.4229 7.9024 3.7645 4.7247 8.2443 3.6273 4.6790 1.3913 3.1117 1.4906 3.3174 1.3389 3.0647 2.3593 1.3142 2.5108 2.3784 3.0164 1.3119 3.3290 1.4717 1.2218 1.6243 3.2017 1.7056 1.6755 1.5382 1.5876 4.8575 1.7623 1.6249 5.0341 1.0953 5.1798 1.1219 2.0852 1.9765 2.5614 6.6634 5.8760 7.2760 4.4412 1.0676 1.0616 1.0970 1.0984 1.0907 1.0904 1.0944 1.0960 1.0776 1.0647 1.0761
irintensity: 1.1780 0.0706 1.1740 1.9434 3.1043 1.6166 9.0085 7.0471 0.7133 0.7732 2.1393 2.3843 3.7560 8.3638 2.4266 17.3866 0.0477 1.9788 26.4003 17.1282 12.1480 23.5533 25.3038 37.6193 0.6022 7.7335 77.8673 12.8040 308.3327 0.8753 4.6380 4.5913 16.2416 8.0128 1.8226 34.8370 12.6912 69.7324 7.3182 0.9642 0.3183 12.7902 0.6948 85.8856 340.8620 30.6102 28.8423 16.0233 378.6340 53.5855 267.9700 529.2218 111.7131 9.7975 19.5937 44.0472 110.3288 38.0602 60.3889 235.8228 39.6511 24.0894 78.9102 170.5140 483.1315 436.5516 48.3302 179.4287 184.6462 211.7259 44.3036 14.1195 14.7811 2.2262 14.6003 2.8136 2.9574 6.3309 146.4496 13.5548 42.4199
temp: 298.150 k
press: 1.00000 atm
elementType: 8 8 8 8 8 7 7 7 6 6 6 6 6 6 6 6 6 6 1 1 1 1 1 1 1 1 1 1 1
symmnumber: 1
zpe: 559806.6 jmol-1
zpe.correction: 0.213219 hartree
zpe.thermalcorrener: 0.230022 hartree
zpe.thermalcorrenthalpy: 0.230966 hartree
zpe.thermalcorrgfe: 0.165494 hartree
zpe.sumelectzpe: -926.673921 hartree
zpe.sumelectthermal: -926.657118 hartree
zpe.sumelectthermalent: -926.656174 hartree
zpe.sumelectthermalfe: -926.721646 hartree
dipole: 10.3772 -2.7055 -0.6406
dipole: 10.7432
quadrupole: -128.2593 -101.8777 -104.6130
quadrupole: -2.6278 5.8831 -0.5589
quadrupole: -16.6760 9.7057 6.9703 -2.6278 5.8831 -0.5589
hfenergy: -926.8871401 hartree
pointgroup: C01 [X(C10H11N3O5)]
dipole: -4.0681579 -1.134869 0.1644314 debye
polarizability: 287.2834105|-2.737192|144.8733472|-5.6375458|-13.5060548|77.44521 unknown
InChI: InChI=1S/C10H11N3O5/c14-9(15)5-6-11-10(16)12-7-1-3-8(4-2-7)13(17)18/h1-4,11-12,14H,5-6H2
charge 0 multiplicity 1
29 atoms
O  -1.122297 1.889608 0.166042
O  -6.423273 -0.922248 -1.254488
O  -4.79579 -1.637449 0.230356
O  5.943462 -1.121591 0.043597
O  5.805063 1.111759 -0.412975
N  -2.65734 0.191153 0.641683
N  -0.382057 -0.33118 0.534718
N  5.267409 -0.027798 -0.116341
C  -3.825415 1.076523 0.588791
C  -4.793195 0.711684 -0.559209
C  1.00976 -0.19529 0.362233
C  -1.373967 0.67528 0.426999
C  1.805313 -1.369592 0.525888
C  1.64239 1.041278 0.038198
C  3.806157 -0.085955 0.048598
C  3.196845 -1.32081 0.371412
C  3.036977 1.088499 -0.117337
C  -5.299661 -0.714779 -0.45913
H  -4.362916 1.040317 1.555367
H  -3.447163 2.102028 0.443872
H  -4.284861 0.823812 -1.536716
H  -5.659166 1.397386 -0.575729
H  -2.864791 -0.80172 0.786816
H  -0.702619 -1.271463 0.778492
H  1.323941 -2.323277 0.775672
H  1.02947 1.9356 -0.081702
H  3.819398 -2.210645 0.493731
H  3.543211 2.025269 -0.36515
H  -6.713389 -1.873399 -1.191585
