program: Gaussian 09
title: 000107704
version: EM64L-G09RevD.01
frameworkgroup: C1[X(C13H10N2O2)]
method: RPBEPBE
basis: SDD
operation: Freq
keyword: #p
keyword: freq=noraman
keyword: PBEPBE/SDD
title: #p freq=noraman PBEPBE/SDD
converged: YES YES NO YES
title: Mulliken charges:
elementType: O O N N C C C C C C C C C C C C C H H H H H H H H H H
charge: -0.236560 -0.262598 -0.480052 0.045864 0.257943 0.175091 0.238704 0.225155 -0.397087 -0.386319 -0.367865 -0.491852 -0.050709 -0.253030 -0.206071 0.192211 -0.505721 0.314106 0.281981 0.244830 0.238336 0.250988 0.229706 0.228593 0.239406 0.239427 0.235522
chargesum: 0.00000
title: Mulliken charges with hydrogens summed into heavy atoms:
elementType: O O N N C C C C C C C C C C C C C
charge: -0.236560 -0.262598 -0.165946 0.045864 0.257943 0.175091 0.238704 0.225155 -0.115106 -0.141489 -0.129529 -0.240863 -0.050709 -0.023323 0.022522 0.192211 0.208633
polarizability: 2.90319558e+02 9.31543925e+00 1.65322251e+02 -3.47113173e-02 9.56107967e-03 6.70365942e+01
1716.lowfreq: -5.3819 -0.0012 -0.0009 -0.0006 3.3527 7.2380 38.1733 67.6780 101.9480
frequency: 38.1594 67.6745 101.9469 108.6774 118.1939 147.6464 196.8948 212.7904 287.7801 292.6135 305.9657 353.7507 424.7889 438.9634 445.8502 467.8060 530.2231 534.6893 568.7502 588.5726 611.0672 623.0406 687.5066 716.7090 748.6629 757.5590 768.1795 780.2309 792.2452 836.0237 862.2421 867.8857 897.3823 930.0281 944.5259 949.6750 981.6398 994.3296 1018.3014 1075.1838 1111.7360 1115.6649 1149.8450 1169.0077 1206.2874 1218.0101 1236.3225 1253.0550 1280.4125 1289.2482 1338.3728 1356.9906 1399.8322 1418.0241 1424.9408 1451.7385 1455.3816 1461.7689 1463.9867 1489.7095 1554.6167 1584.3940 1594.0343 1606.1226 1638.6844 3001.1156 3100.4795 3118.7018 3132.3806 3141.2814 3149.9985 3153.2455 3168.7459 3169.7843 3607.3550
redmass: 5.4939 4.2297 4.8359 1.2770 3.8647 3.4518 5.1927 4.5949 7.2448 5.4039 4.3994 5.6130 3.0095 7.8494 2.9250 6.9699 1.1368 4.8430 3.9288 7.0228 8.0606 7.5746 6.8881 4.6595 6.0822 1.4737 4.5264 5.9015 3.9315 5.1694 1.4766 6.6962 1.4764 7.4629 1.3762 1.4696 1.3186 3.6536 1.9723 3.8431 1.2648 1.7604 1.5048 1.1312 2.8676 2.1237 1.4804 2.8791 2.3050 2.5232 2.6807 3.3006 5.3728 1.6080 1.6385 1.0501 3.1746 1.1409 2.9692 3.6625 6.9526 7.6494 7.8934 7.4419 7.8759 1.0298 1.1042 1.0918 1.0856 1.0894 1.1043 1.0957 1.0943 1.0992 1.0803
irintensity: 2.9593 0.4359 1.9009 0.6425 0.1412 2.7910 4.3765 2.3155 0.3707 4.9625 20.0084 1.4370 17.2306 4.4317 0.7274 4.2981 102.6661 0.7901 0.6012 7.1252 2.2437 15.3794 10.1853 36.1499 3.5436 78.2350 0.2969 12.5810 16.5960 0.2882 0.0000 8.6203 20.3167 16.9631 7.8420 5.3694 0.0029 8.0284 13.9314 126.2623 0.0632 17.3705 68.5584 9.5110 38.3082 151.3418 21.9136 228.3778 89.9782 7.5990 125.1843 61.3728 0.9544 17.8431 54.4978 13.8907 27.6422 6.1054 9.2756 40.5520 20.5838 40.4009 106.8834 48.4167 26.0865 48.4224 29.2823 21.3251 0.7036 3.3699 18.4301 24.0079 2.7467 25.0692 70.3472
temp: 298.150 k
press: 1.00000 atm
elementType: 8 8 7 7 6 6 6 6 6 6 6 6 6 6 6 6 6 1 1 1 1 1 1 1 1 1 1
symmnumber: 1
zpe: 532849.2 jmol-1
zpe.correction: 0.202952 hartree
zpe.thermalcorrener: 0.216547 hartree
zpe.thermalcorrenthalpy: 0.217491 hartree
zpe.thermalcorrgfe: 0.161990 hartree
zpe.sumelectzpe: -760.179782 hartree
zpe.sumelectthermal: -760.166187 hartree
zpe.sumelectthermalent: -760.165242 hartree
zpe.sumelectthermalfe: -760.220744 hartree
dipole: -3.8988 1.9820 0.0014
dipole: 4.3737
quadrupole: -78.2272 -89.3110 -101.7093
quadrupole: -5.6122 0.0000 0.0081
quadrupole: 11.5220 0.4381 -11.9601 -5.6122 0.0000 0.0081
hfenergy: -760.3827337 hartree
pointgroup: C01 [X(C13H10N2O2)]
dipole: -1.5238996 -0.7991751 -0.0005648 debye
polarizability: 290.5356114|-7.7281711|165.1061977|0.0345873|0.0100003|67.0365942 unknown
InChI: InChI=1S/C13H10N2O2/c1-17-13(16)11-6-9-8-4-2-3-5-10(8)15-12(9)7-14-11/h2-7,15H,1H3
charge 0 multiplicity 1
27 atoms
O  4.376027 -0.227435 0.000815
O  3.382724 1.876715 0.000301
N  -1.776438 -1.853543 -0.000324
N  1.960612 -1.478626 0.000833
C  -0.452685 0.032444 0.000434
C  -1.847968 0.455044 0.000144
C  -2.643551 -0.743042 -0.000346
C  -0.451865 -1.407979 0.000168
C  0.790564 0.693302 0.000901
C  -2.48806 1.716458 0.00024
C  -4.053231 -0.704883 -0.000748
C  0.768425 -2.123288 0.000376
C  1.965204 -0.101428 0.001138
C  -3.897248 1.763511 -0.000157
C  -4.66781 0.56577 -0.000644
C  3.277444 0.620512 0.001765
C  5.691575 0.454735 -0.000355
H  -2.070275 -2.827899 -0.00058
H  0.891152 1.782296 0.001156
H  -1.900398 2.640694 0.000604
H  -4.654692 -1.620068 -0.001122
H  0.80291 -3.21912 0.000137
H  -4.410267 2.730759 -0.000093
H  -5.761373 0.631855 -0.000949
H  5.797779 1.087288 0.897432
H  5.796181 1.087351 -0.898286
H  6.425164 -0.363024 -0.001042
