program: Gaussian 09
title: 000107723
version: EM64L-G09RevD.01
frameworkgroup: C1[X(C12H15ClNO4PS2)]
method: RPBEPBE
basis: SDD
operation: Freq
keyword: #p
keyword: freq=noraman
keyword: PBEPBE/SDD
title: #p freq=noraman PBEPBE/SDD
converged: YES YES NO NO
title: Mulliken charges:
elementType: Cl S S P O O O O N C C C C C C C C C C C C H H H H H H H H H H H H H H H
charge: -0.045183 0.033685 -0.215448 0.610174 -0.232550 -0.477872 -0.461315 -0.193478 -0.204267 0.355475 -0.680773 0.179450 0.203628 -0.291284 -0.309520 -0.091486 -0.198174 -0.212464 -0.219552 -0.662561 -0.650201 0.292692 0.350975 0.278458 0.265243 0.263773 0.235843 0.234422 0.238762 0.220370 0.209908 0.226715 0.266270 0.212970 0.227388 0.239927
chargesum: 0.00000
title: Mulliken charges with hydrogens summed into heavy atoms:
elementType: Cl S S P O O O O N C C C C C C C C C C C C
charge: -0.045183 0.033685 -0.215448 0.610174 -0.232550 -0.477872 -0.461315 -0.193478 -0.204267 0.355475 -0.037106 0.179450 0.203628 -0.012826 -0.044277 -0.091486 0.065599 0.257801 0.239581 0.040332 0.030085
polarizability: 3.15188319e+02 1.38089533e+01 2.37963954e+02 8.06820923e+00 -5.12827012e+00 1.54119852e+02
1716.lowfreq: -8.4282 -3.6410 0.0020 0.0023 0.0025 7.9513 13.0740 13.5454 28.2896
frequency: 12.2548 12.9661 28.1815 36.8232 51.9414 59.0310 63.8938 69.3713 82.0017 88.6444 93.6238 121.0162 130.5393 179.5184 186.3095 189.4606 208.2795 234.6976 242.8561 252.7134 273.8169 289.4315 289.6426 318.3370 324.2781 347.1033 359.4226 378.9814 401.7214 426.9558 432.7732 528.5113 541.5602 577.5692 582.9206 624.8097 637.5251 671.8427 673.4823 689.8604 712.8153 721.6800 744.2800 806.4870 810.7217 811.7440 834.6847 853.3124 858.6488 862.4538 886.6152 933.6256 942.7434 1010.2627 1023.4783 1033.2012 1052.0263 1085.3219 1103.5916 1109.2747 1132.5352 1135.4874 1143.0571 1211.7745 1252.2569 1255.1159 1257.0023 1280.7363 1311.6375 1347.4762 1352.0968 1356.2789 1395.0516 1395.7800 1397.3893 1433.8750 1448.9315 1457.5469 1459.1735 1469.7528 1472.8103 1475.5035 1483.4250 1487.3364 1612.2912 1625.7569 1736.3374 2982.8505 2997.1794 2997.5164 3001.2287 3044.4082 3049.9885 3067.3558 3093.8193 3093.9185 3111.6634 3126.7686 3133.8105 3174.1714 3179.6828 3192.3045
redmass: 5.5360 7.2329 5.3588 4.4926 2.3063 2.1211 5.0119 3.6378 5.4961 5.3213 9.0226 6.9147 8.8269 9.0500 4.3541 6.5105 5.8940 1.2648 1.7674 2.3189 5.9829 3.8348 3.5175 6.5172 7.2265 11.9820 8.5858 6.3771 8.7937 3.3144 5.6730 7.5451 11.5212 4.5172 5.4699 7.6748 7.8813 6.1408 8.8786 9.8380 8.0200 4.7523 7.6429 1.3690 1.1032 1.0901 5.8131 1.4490 4.3188 2.6662 3.6413 1.3388 4.3847 2.2784 2.7711 2.8072 2.2536 3.1769 2.2445 2.2058 1.4232 1.4304 1.4134 3.4362 1.2780 1.1420 1.1397 1.3938 1.5692 2.5059 1.3287 1.2938 1.3286 5.0041 1.2412 1.8269 1.5125 1.0406 1.0413 1.0739 4.1268 1.0574 1.0617 1.0760 8.5796 8.7599 12.0199 1.0564 1.0471 1.0371 1.0456 1.0580 1.1071 1.1089 1.0978 1.0978 1.1020 1.1018 1.1102 1.0896 1.0941 1.0979
irintensity: 0.1046 0.1991 0.5083 0.4961 0.0652 1.4540 2.0212 3.5144 0.6372 2.8465 1.1919 7.0169 0.2309 0.0452 0.6952 2.1748 2.0036 0.0348 0.8388 0.5446 4.0721 17.9017 3.6978 2.3741 3.8433 1.6648 0.1389 9.7296 117.6900 13.1244 0.9023 21.7952 191.5415 5.2920 19.4466 11.3603 79.4560 51.3619 4.1069 13.9545 96.3995 1.4037 13.0183 52.8284 15.3724 7.9822 36.4182 29.0766 173.6857 157.6027 40.9356 0.6465 94.3550 138.7630 49.5429 16.3035 25.1075 21.7009 12.1575 3.6943 0.3420 10.5864 49.3994 65.7497 14.3371 0.0781 0.1932 91.8863 69.6149 64.2698 27.8829 4.9171 45.2898 4.6983 29.2312 28.9886 31.9654 10.5782 9.1904 7.4248 243.4712 6.1913 8.8375 13.5378 88.0210 23.7483 579.3185 25.3559 18.0603 20.0160 27.8609 12.9510 11.9595 15.1500 30.3536 18.8589 29.1200 17.6647 4.1283 0.2870 1.6003 0.4409
temp: 298.150 k
press: 1.00000 atm
elementType: 17 16 16 15 8 8 8 8 7 6 6 6 6 6 6 6 6 6 6 6 6 1 1 1 1 1 1 1 1 1 1 1 1 1 1 1
symmnumber: 1
zpe: 679148.2 jmol-1
zpe.correction: 0.258674 hartree
zpe.thermalcorrener: 0.282587 hartree
zpe.thermalcorrenthalpy: 0.283531 hartree
zpe.thermalcorrgfe: 0.200062 hartree
zpe.sumelectzpe: -2417.763389 hartree
zpe.sumelectthermal: -2417.739475 hartree
zpe.sumelectthermalent: -2417.738531 hartree
zpe.sumelectthermalfe: -2417.822001 hartree
dipole: -1.6208 -1.6565 -1.9507
dipole: 3.0293
quadrupole: -148.5854 -150.2668 -159.7791
quadrupole: -7.7440 -5.9769 8.4202
quadrupole: 4.2917 2.6103 -6.9020 -7.7440 -5.9769 8.4202
hfenergy: -2418.0220627 hartree
pointgroup: C01 [X(C12H15Cl1N1O4P1S2)]
dipole: 0.6939529 -0.6346091 0.7321828 debye
polarizability: 317.0380685|-6.2696927|234.753776|8.669068|11.4477082|155.4802811 unknown
InChI: InChI=1S/C8H5ClNO2S.C4H10O2PS/c9-5-1-2-7-6(3-5)10(4-13)8(11)12-7;1-3-5-7(8)6-4-2/h1-3H,4H2;3-4H2,1-2H3
charge 0 multiplicity 1
36 atoms
Cl 5.246795 -2.249138 -0.549852
S  -0.856418 -0.945193 -1.169604
S  -4.317726 -1.154715 -2.360336
P  -3.128019 -0.890746 -0.699922
O  1.906076 2.642897 0.236813
O  -3.310049 0.502833 0.302944
O  -3.257971 -1.99805 0.628249
O  -0.427504 2.642832 0.666473
N  0.838085 0.624166 0.416587
C  2.193613 0.348239 0.129516
C  -0.231672 -0.337125 0.555593
C  2.845345 1.60205 0.032816
C  0.622728 2.019807 0.465029
C  2.893316 -0.855957 -0.04782
C  4.210263 1.722699 -0.230058
C  4.275879 -0.727046 -0.311376
C  4.938555 0.51663 -0.403174
C  -3.568724 1.828338 -0.35613
C  -3.347805 -3.453344 0.304196
C  -3.784898 2.81909 0.780733
C  -3.458427 -4.170871 1.645725
H  0.111896 -1.218436 1.114422
H  -1.092844 0.138646 1.051944
H  2.410344 -1.83484 -0.001476
H  4.697568 2.697783 -0.301414
H  6.010788 0.548727 -0.61153
H  -2.686678 2.098534 -0.965189
H  -4.457507 1.723939 -1.006154
H  -4.236685 -3.623792 -0.331755
H  -2.439881 -3.756802 -0.25362
H  -4.013918 3.814157 0.355714
H  -4.628484 2.508179 1.419761
H  -2.871201 2.907493 1.388853
H  -3.538074 -5.260901 1.478453
H  -2.571018 -3.976825 2.271604
H  -4.354248 -3.834359 2.193782
