program: Gaussian 09
title: 000107669
version: EM64L-G09RevD.01
frameworkgroup: C1[X(C10H13N3O)]
method: RPBEPBE
basis: SDD
operation: Freq
keyword: #p
keyword: freq=noraman
keyword: PBEPBE/SDD
title: #p freq=noraman PBEPBE/SDD
converged: YES YES NO NO
title: Mulliken charges:
elementType: O N N N C C C C C C C C C C H H H H H H H H H H H H H
charge: -0.448422 -0.129351 -0.649624 -0.513262 -0.222159 -0.516221 0.295765 -0.545892 0.278830 -0.350051 -0.391929 0.289059 -0.245798 -0.240721 0.210655 0.219788 0.271302 0.234769 0.236801 0.254375 0.223446 0.226146 0.224842 0.399507 0.320908 0.323631 0.243607
chargesum: 0.00000
title: Mulliken charges with hydrogens summed into heavy atoms:
elementType: O N N N C C C C C C C C C C
charge: -0.048914 -0.129351 -0.005085 -0.269655 -0.011505 -0.025131 0.295765 -0.074322 0.278830 -0.095677 -0.168483 0.289059 -0.019652 -0.015879
polarizability: 1.49638469e+02 -1.90622822e-01 1.36635071e+02 -3.27749849e+00 -3.90000530e+00 9.20005982e+01
1716.lowfreq: -16.0859 -9.0371 0.0007 0.0008 0.0010 9.4594 44.2269 94.5264 117.1046
frequency: 43.9140 94.5210 117.0945 183.8234 233.1012 257.3853 293.8526 323.3158 348.3158 389.3023 408.2635 413.2046 436.3499 453.6139 485.8463 510.7927 540.3640 586.9275 608.3901 674.0173 694.5823 711.5819 729.6339 731.0852 766.4568 789.9114 858.8204 868.6000 889.2585 917.2887 938.9844 963.9125 986.5564 999.2839 1023.5731 1034.6994 1049.7985 1086.5869 1100.6759 1133.2362 1154.2122 1172.7440 1192.4214 1204.6171 1240.8419 1245.5690 1283.3195 1296.5201 1321.0000 1335.5930 1360.0006 1385.8220 1435.0763 1437.9922 1443.7774 1473.4819 1480.3805 1553.0483 1586.7394 1592.9767 1613.9555 1623.7557 2681.3884 2963.6824 2979.3622 3000.3538 3064.6683 3091.1243 3104.6105 3126.6274 3140.9437 3159.3095 3421.5255 3547.2173 3696.6382
redmass: 4.5823 4.2771 4.4105 5.5536 5.0241 4.0540 3.1771 3.5566 4.9319 3.2285 1.8696 1.4512 1.2461 2.1182 3.5954 3.2974 3.8185 3.7619 4.7660 4.8688 3.2652 4.0172 1.3761 2.1765 1.8175 3.4835 1.6213 3.0232 2.6555 1.1359 1.6273 2.0055 1.3289 2.2589 3.2532 2.2925 1.6091 2.5821 1.5636 1.5641 3.0450 1.0642 2.3997 2.3125 1.3582 1.4986 1.4908 1.2314 1.3969 1.4303 1.4171 4.8125 1.4413 2.1980 1.2765 1.8944 2.2270 1.2431 4.7547 2.3430 6.2881 1.6281 1.0773 1.0680 1.0796 1.0708 1.0935 1.0985 1.0878 1.0871 1.0936 1.1005 1.0768 1.0452 1.1041
irintensity: 1.9510 3.0583 1.6399 6.5899 5.8618 2.7827 4.3757 8.8945 5.4089 16.4863 100.2897 116.4283 60.8693 37.3218 6.2295 2.2305 7.5477 25.7522 26.7340 17.9057 20.6886 2.7752 40.7906 29.7286 36.7712 6.8006 0.6515 8.9023 9.5456 111.5872 1.3560 9.5428 0.2467 23.1946 27.9674 9.8221 7.8513 7.5175 144.4544 3.0255 6.0839 0.2055 4.2220 5.6769 10.4849 12.8555 3.1710 28.9517 18.4950 6.0008 8.4679 4.2316 63.8850 23.3294 70.8202 93.0702 13.4189 182.5611 25.2818 113.2765 2.1392 165.6984 895.7243 43.8306 7.7695 76.4682 11.6656 10.9114 13.6471 5.1540 25.0317 33.2031 10.3886 36.5810 26.4809
temp: 298.150 k
press: 1.00000 atm
elementType: 8 7 7 7 6 6 6 6 6 6 6 6 6 6 1 1 1 1 1 1 1 1 1 1 1 1 1
symmnumber: 1
zpe: 580716.5 jmol-1
zpe.correction: 0.221183 hartree
zpe.thermalcorrener: 0.232982 hartree
zpe.thermalcorrenthalpy: 0.233926 hartree
zpe.thermalcorrgfe: 0.183700 hartree
zpe.sumelectzpe: -627.303821 hartree
zpe.sumelectthermal: -627.292023 hartree
zpe.sumelectthermalent: -627.291079 hartree
zpe.sumelectthermalfe: -627.341304 hartree
dipole: -2.3395 -5.3887 0.7046
dipole: 5.9167
quadrupole: -69.6998 -82.1529 -80.0132
quadrupole: 8.7981 3.3180 4.7829
quadrupole: 7.5888 -4.8643 -2.7245 8.7981 3.3180 4.7829
hfenergy: -627.5250045 hartree
pointgroup: C01 [X(C10H13N3O1)]
dipole: -0.9505155 -2.0985438 0.3337059 debye
polarizability: 149.4628513|-0.5721773|136.4987135|-4.5381311|-4.604504|92.3125737 unknown
InChI: InChI=1S/C10H13N3O/c11-10(12)13-5-7-3-1-2-4-8(7)9(14)6-13/h1-4,9,11,14H,5-6,12H2
charge 0 multiplicity 1
27 atoms
O  -0.575637 2.323658 -0.553928
N  -1.603906 -0.407412 0.796308
N  -2.991079 -1.665585 -0.632591
N  -2.601942 0.686024 -1.045992
C  -0.078854 1.590884 0.608313
C  -1.233574 0.906786 1.381403
C  1.001533 0.563216 0.228254
C  -0.504389 -1.391736 0.945796
C  0.813013 -0.837019 0.389951
C  2.223659 1.033436 -0.314361
C  1.847665 -1.732385 0.021412
C  -2.418603 -0.424381 -0.34436
C  3.253053 0.140559 -0.675779
C  3.066347 -1.252451 -0.502733
H  0.380282 2.357337 1.265052
H  -0.934938 0.711172 2.429878
H  -2.116379 1.5668 1.375822
H  -0.767922 -2.323469 0.417591
H  -0.398163 -1.637515 2.022594
H  2.346441 2.112362 -0.462553
H  1.695316 -2.813441 0.14038
H  4.192217 0.522234 -1.091888
H  3.858907 -1.9554 -0.78334
H  -1.396095 1.787491 -0.904396
H  -3.399814 -1.838689 -1.546636
H  -3.12006 -2.358479 0.101043
H  -3.376576 0.653404 -1.72784
