program: Gaussian 09
title: 000107683
version: EM64L-G09RevD.01
frameworkgroup: C1[X(C17H17NO3)]
method: RPBEPBE
basis: SDD
operation: Freq
keyword: #p
keyword: freq=noraman
keyword: PBEPBE/SDD
title: #p freq=noraman PBEPBE/SDD
converged: YES YES NO NO
title: Mulliken charges:
elementType: O O O N C C C C C C C C C C C C C C C C C H H H H H H H H H H H H H H H H H
charge: -0.245533 -0.262487 -0.244417 0.012489 -0.341672 -0.396858 -0.350771 -0.312279 0.372948 0.305734 -0.691297 0.012444 -0.501713 -0.375790 0.338047 0.002629 -0.305959 -0.507389 -0.277353 0.170631 -0.312848 0.189079 0.188964 0.215964 0.215910 0.198796 0.198650 0.216835 0.216619 0.210841 0.210850 0.221021 0.285701 0.264846 0.269679 0.281306 0.265592 0.260791
chargesum: 0.00000
title: Mulliken charges with hydrogens summed into heavy atoms:
elementType: O O O N C C C C C C C C C C C C C C C C C
charge: -0.245533 -0.262487 -0.244417 0.012489 0.036371 0.035016 0.046675 0.121174 0.372948 0.305734 -0.048585 0.012444 -0.216012 -0.110944 0.338047 0.002629 -0.036280 -0.226083 -0.011761 0.170631 -0.052056
polarizability: 4.37669827e+02 7.54774055e+01 2.30744995e+02 -3.01025343e-02 8.59089776e-02 9.90434176e+01
1716.lowfreq: -2.8716 -0.0009 -0.0003 0.0007 8.2840 9.7437 23.9666 41.4040 54.1360
frequency: 23.7127 41.3657 53.5570 59.0622 70.1135 105.5892 123.8852 127.8576 153.7851 171.8823 184.4251 207.4182 217.9772 234.3590 258.7203 309.5120 311.1169 348.5518 379.9431 427.2883 432.2251 435.0369 457.3896 464.8589 493.5384 517.5843 554.1861 585.0969 608.4005 619.5820 639.5677 695.6163 720.8773 732.1582 734.1926 755.5712 773.7015 810.9284 821.9058 828.2232 842.6104 845.0112 861.0522 873.3915 881.1396 894.6141 938.1370 965.9462 969.2509 972.5793 984.0834 1020.6894 1071.3393 1074.7002 1077.7884 1093.3840 1127.0203 1128.9577 1145.2940 1146.5571 1203.4422 1206.8655 1223.2587 1253.2158 1257.3941 1263.0329 1269.0267 1289.7166 1295.0676 1297.6438 1322.9241 1338.7692 1359.3199 1363.9127 1379.9237 1396.1661 1410.8201 1444.9522 1462.2052 1465.0438 1467.7787 1471.0413 1478.3923 1480.2610 1484.7237 1490.7630 1532.7736 1550.1596 1567.4233 1605.2390 1650.8465 2957.6990 2961.0989 2973.4946 2975.6348 2997.3907 3000.2983 3019.6314 3029.5856 3065.3966 3073.0779 3076.1279 3149.1863 3163.6490 3172.4561 3176.4045 3181.4410 3185.1141
redmass: 4.1477 4.7828 2.0926 3.4756 4.2423 3.8803 4.2330 1.7617 2.8545 5.0811 5.6927 6.2811 4.4627 1.1176 7.1362 5.5061 4.4960 6.9694 4.9579 3.6940 5.1549 4.4656 5.3337 3.1284 4.6910 5.3225 10.3812 7.9204 4.3825 6.2158 3.2934 8.0516 3.4424 1.0730 7.7186 3.6818 1.1246 5.8512 1.4428 1.5203 5.5776 1.4971 1.2569 1.7181 3.3009 2.2512 4.2616 1.3242 3.4642 1.1572 1.2926 3.5424 2.4646 2.8846 2.4770 1.9189 1.8738 1.8547 1.4367 2.1646 1.4440 1.6956 2.4060 2.7224 1.3400 1.2358 1.6745 1.0598 1.1159 3.9553 1.3780 2.1841 1.5598 4.0513 1.5081 1.2228 5.7564 5.8304 6.3483 1.3683 1.0715 1.2930 1.3475 1.0426 1.2134 1.1259 7.4144 8.2410 8.4387 6.7774 8.0425 1.0571 1.0570 1.0588 1.0372 1.0593 1.0993 1.1055 1.1044 1.1050 1.1015 1.0992 1.0872 1.0886 1.0980 1.0943 1.0921 1.0974
irintensity: 0.0126 0.4644 0.5658 0.0120 2.2360 0.0903 0.7374 0.2697 0.0719 5.6268 0.1611 8.1907 0.1405 0.0088 0.2932 0.3134 0.7061 1.7655 18.2682 0.7223 3.4108 7.5252 4.0385 0.4469 20.2275 17.2006 2.8948 25.4657 0.0873 2.6182 15.8056 4.5285 0.5566 11.7283 1.1159 0.1784 0.7034 2.3108 3.1770 23.4446 26.9939 53.9577 2.8949 82.9744 7.2955 23.2768 16.8002 0.0449 115.8965 1.2185 0.0006 8.8055 32.6794 7.6804 1.1794 184.9797 13.3422 10.2053 0.6519 37.2109 0.6211 208.5016 31.2542 183.3795 7.3787 0.0822 127.2963 0.0038 0.8626 87.7797 2.5222 39.1201 1.9491 13.1495 22.3736 14.2809 9.9504 51.2406 144.9046 111.5097 1.8177 73.8795 28.1887 13.4213 15.5831 14.7150 88.4696 20.6437 51.5850 658.0391 33.4314 4.4293 20.6697 53.9969 34.2381 37.2817 2.2373 19.3857 10.0296 21.1267 124.5426 52.5797 0.2043 0.8044 12.3488 1.4943 2.2725 6.3433
temp: 298.150 k
press: 1.00000 atm
elementType: 8 8 8 7 6 6 6 6 6 6 6 6 6 6 6 6 6 6 6 6 6 1 1 1 1 1 1 1 1 1 1 1 1 1 1 1 1 1
symmnumber: 1
zpe: 788602.8 jmol-1
zpe.correction: 0.300363 hartree
zpe.thermalcorrener: 0.319349 hartree
zpe.thermalcorrenthalpy: 0.320293 hartree
zpe.thermalcorrgfe: 0.251622 hartree
zpe.sumelectzpe: -936.891878 hartree
zpe.sumelectthermal: -936.872892 hartree
zpe.sumelectthermalent: -936.871948 hartree
zpe.sumelectthermalfe: -936.940619 hartree
dipole: 7.6121 2.4889 0.0065
dipole: 8.0087
quadrupole: -137.5843 -131.8966 -125.2219
quadrupole: -25.8548 -0.0279 0.0115
quadrupole: -6.0167 -0.3290 6.3457 -25.8548 -0.0279 0.0115
hfenergy: -937.192241 hartree
pointgroup: C01 [X(C17H17N1O3)]
dipole: 3.0193524 0.8946421 0.1048707 debye
polarizability: 441.424262|69.4158172|226.4811162|10.2466528|6.8730164|99.5528619 unknown
InChI: InChI=1S/C17H17NO3/c1-2-3-4-9-20-13-6-8-15-17(11-13)21-16-10-12(19)5-7-14(16)18-15/h5-8,10-11H,2-4,9H2,1H3
charge 0 multiplicity 1
38 atoms
O  2.950096 1.162341 0.168509
O  -1.472176 -0.873102 -0.007746
O  -5.924143 -2.69288 -0.182468
N  -2.640594 1.762814 0.079488
C  5.930815 -1.229715 0.139465
C  5.121392 0.08791 0.166852
C  7.457354 -0.987583 0.175552
C  3.61454 -0.164853 0.130742
C  1.56356 1.213243 0.142805
C  -0.661401 0.269879 0.057347
C  8.271906 -2.29848 0.152659
C  -1.256439 1.571683 0.10002
C  0.726872 0.071039 0.07795
C  1.0039 2.527589 0.186845
C  -2.880108 -0.704982 -0.031064
C  -3.416042 0.66598 0.01644
C  -0.381846 2.696378 0.16568
C  -3.67916 -1.819093 -0.096471
C  -4.861868 0.807129 -0.008086
C  -5.142416 -1.6777 -0.1219
C  -5.68231 -0.294155 -0.073269
H  5.676889 -1.808202 -0.773292
H  5.643854 -1.864833 1.003458
H  5.400099 0.720663 -0.697336
H  5.367043 0.662693 1.080243
H  7.745815 -0.355217 -0.688274
H  7.712019 -0.407536 1.085531
H  3.283805 -0.759354 1.006814
H  3.315933 -0.692609 -0.798023
H  8.025581 -2.935135 1.023254
H  8.059087 -2.883461 -0.761939
H  9.35831 -2.097596 0.178794
H  1.115745 -0.948882 0.043518
H  1.686595 3.379741 0.237003
H  -0.83713 3.690291 0.198755
H  -3.254661 -2.826172 -0.131118
H  -5.251169 1.829472 0.027889
H  -6.773445 -0.201204 -0.092524
