program: Gaussian 09
title: 000107758
version: EM64L-G09RevD.01
frameworkgroup: C1[X(C6H16O18P4)]
method: RPBEPBE
basis: SDD
operation: Freq
keyword: #p
keyword: freq=noraman
keyword: PBEPBE/SDD
title: #p freq=noraman PBEPBE/SDD
converged: NO YES NO NO
title: Mulliken charges:
elementType: P P P P O O O O O O O O O O O O O O O O O O C C C C C C H H H H H H H H H H H H H H H H
charge: 1.444930 1.411234 1.388927 1.420559 -0.504098 -0.623295 -0.505201 -0.505602 -0.565838 -0.457970 -0.637416 -0.634048 -0.671249 -0.689273 -0.711298 -0.653511 -0.650735 -0.656521 -0.678490 -0.590725 -0.575956 -0.616061 -0.140406 -0.064640 -0.155026 -0.214074 -0.133126 -0.045662 0.338839 0.308158 0.313866 0.313288 0.289499 0.281152 0.402937 0.378933 0.436591 0.414508 0.443722 0.412626 0.402662 0.435997 0.420259 0.421534
chargesum: 0.00000
title: Mulliken charges with hydrogens summed into heavy atoms:
elementType: P P P P O O O O O O O O O O O O O O O O O O C C C C C C
charge: 1.444930 1.411234 1.388927 1.420559 -0.504098 -0.623295 -0.505201 -0.505602 -0.162901 -0.079037 -0.222909 -0.197458 -0.268587 -0.253276 -0.267576 -0.240885 -0.229201 -0.236262 -0.678490 -0.590725 -0.575956 -0.616061 0.198433 0.249226 0.153132 0.099214 0.148026 0.243837
polarizability: 2.52194522e+02 -9.45851341e+00 2.45599933e+02 -2.03236156e+00 -3.14403551e+00 1.61838981e+02
1716.lowfreq: -6.7224 -0.5075 -0.0016 -0.0006 -0.0005 6.5890 16.6992 19.3858 29.3089
frequency: 16.5052 19.2882 29.2575 43.0220 45.0493 49.0293 64.9755 79.9887 84.4058 94.6106 114.7262 118.2731 122.9157 137.0922 142.2546 152.8617 160.2976 166.3743 181.8572 186.7539 198.6400 206.4234 217.2494 220.8752 228.3403 239.1335 245.7536 261.8394 264.1597 286.8342 287.3220 294.0810 309.7603 317.2301 321.9424 327.1878 333.2745 346.5721 348.6549 355.1624 361.5194 368.9427 379.6617 389.0950 391.6782 397.5094 411.3701 427.0601 437.9366 442.0209 463.1685 492.9723 537.2434 558.3600 602.3713 633.0669 646.2532 656.9981 670.5681 688.8813 693.9791 705.4535 712.9577 732.8950 761.7745 773.1616 773.9144 786.2640 788.9048 828.1036 852.6788 882.0190 918.8000 930.4966 941.5714 970.8353 984.2348 989.5877 991.0215 1004.3496 1013.6833 1024.0031 1031.5209 1041.8642 1059.5615 1065.3585 1072.4601 1079.7791 1086.6811 1096.4778 1103.4765 1106.9463 1115.0924 1124.1007 1182.3501 1221.1863 1232.1946 1262.9876 1287.2865 1298.0127 1301.1835 1312.5150 1329.1765 1342.1573 1347.7971 1359.9794 1366.2063 1385.8886 1387.8590 1411.5606 2392.9698 2913.7172 2998.0187 3000.6215 3009.5893 3024.8069 3058.0155 3078.9296 3200.7440 3348.9355 3559.0373 3573.4560 3582.3590 3592.1393 3593.2053 3598.0807
redmass: 8.2606 11.5572 7.2220 9.6357 8.9164 9.5949 8.0893 10.6464 9.7675 8.6255 4.7178 2.2499 8.7408 4.2761 6.3539 8.7227 6.6890 8.6929 6.4564 4.7240 4.7182 6.3716 2.8674 3.5843 2.7867 4.9889 3.9107 3.3079 3.5432 2.4051 3.9886 5.2782 2.1607 3.8857 2.7229 5.4247 8.0593 1.7459 7.6297 6.3847 6.4895 8.0178 6.1637 9.1115 10.0168 3.6021 6.9846 3.8155 6.9481 1.7879 5.2028 5.8004 5.1960 4.2356 5.2035 7.7900 1.8390 7.0101 1.5933 3.4650 3.2178 5.1722 6.8008 5.9836 6.6769 7.2315 6.7092 8.0940 8.6606 13.8457 1.2650 3.8991 6.3207 5.1628 7.6257 2.0686 2.9713 2.8031 2.8462 3.4508 1.4220 5.0751 1.3062 1.1807 1.6390 2.7784 2.6706 2.0362 3.3535 4.5189 1.3824 2.7537 3.1041 3.2808 1.3458 1.2373 1.2479 1.2137 1.2248 1.2345 1.2132 1.2568 1.4787 1.1340 1.2928 1.3201 1.2345 1.2327 1.4155 1.1489 1.0813 1.0711 1.0846 1.0844 1.0845 1.0873 1.0853 1.0856 1.0699 1.0647 1.0661 1.0660 1.0662 1.0661 1.0664 1.0666
irintensity: 3.4365 1.0021 9.1936 4.7603 0.2791 1.2174 4.3962 2.7231 8.3081 0.7578 29.2347 60.0450 5.5938 61.0415 10.8286 9.2984 18.5597 7.5487 5.5681 44.0904 1.9762 5.1848 46.6363 35.1712 14.5792 34.2970 8.3988 9.7958 33.3961 69.8653 97.2211 40.0625 18.0144 58.5985 72.0586 15.2013 6.4256 142.3555 26.9197 101.7797 31.0401 57.7326 102.0424 21.8219 12.2244 29.0529 20.6487 31.0366 105.1148 117.4978 13.6091 15.3986 16.5758 30.4524 8.4193 50.9691 69.9340 21.0001 203.7959 84.2570 160.0255 34.4240 295.3644 237.3397 28.7777 242.1920 322.3648 211.8124 93.1384 116.3427 325.6387 35.6394 320.9305 34.6238 207.4396 253.4770 241.8057 165.9900 141.6431 28.9810 29.8909 12.3970 77.9431 342.6628 86.6418 19.6091 9.7215 92.5410 73.9152 128.3649 135.2456 26.4846 147.1911 3.4009 10.3092 11.6094 3.4577 7.9909 16.0993 133.7378 21.3937 6.3530 47.6215 128.8723 37.3329 15.0046 2.5782 2.0140 9.1399 80.3476 1781.0929 1240.8231 21.7222 14.1107 6.9266 10.7529 2.5779 5.1579 313.3312 210.4671 78.4942 98.9157 28.6158 53.0657 143.2754 141.1581
temp: 298.150 k
press: 1.00000 atm
elementType: 15 15 15 15 8 8 8 8 8 8 8 8 8 8 8 8 8 8 8 8 8 8 6 6 6 6 6 6 1 1 1 1 1 1 1 1 1 1 1 1 1 1 1 1
symmnumber: 1
zpe: 730760.6 jmol-1
zpe.correction: 0.278332 hartree
zpe.thermalcorrener: 0.311650 hartree
zpe.thermalcorrenthalpy: 0.312594 hartree
zpe.thermalcorrgfe: 0.212983 hartree
zpe.sumelectzpe: -2954.915012 hartree
zpe.sumelectthermal: -2954.881694 hartree
zpe.sumelectthermalent: -2954.880750 hartree
zpe.sumelectthermalfe: -2954.980361 hartree
dipole: 0.7719 -4.8868 -2.3368
dipole: 5.4715
quadrupole: -165.6135 -224.3571 -207.1296
quadrupole: -28.9743 -0.5014 22.0537
quadrupole: 33.4199 -25.3237 -8.0962 -28.9743 -0.5014 22.0537
hfenergy: -2955.1933437 hartree
pointgroup: C01 [X(C6H16O18P4)]
dipole: 1.8473268 -0.7248774 -0.8341905 debye
polarizability: 255.3394696|6.6361667|241.7455888|8.9488559|2.3266649|162.5483779 unknown
InChI: InChI=1S/C6H16O18P4/c7-1-3(21-25(9,10)11)2(8)5(23-27(15,16)17)6(24-28(18,19)20)4(1)22-26(12,13)14/h1-10,12-13,15-16,18-19H
charge 0 multiplicity 1
44 atoms
P  -2.985076 -2.221352 -0.644429
P  0.352746 -4.030049 0.531994
P  -2.609649 3.185219 0.296402
P  3.795672 2.374741 0.604087
O  -2.262828 -0.857344 0.114146
O  -0.1261 -2.63642 -0.490164
O  -1.748594 1.902088 -0.560521
O  3.073976 1.072358 -0.273859
O  0.842119 2.895323 0.569174
O  1.453461 -0.618692 -1.886277
O  -4.520076 -1.617813 -0.996679
O  -2.258162 -2.390637 -2.177293
O  -2.907367 2.458186 1.840947
O  -1.385236 4.273971 0.672678
O  -1.013954 -4.982308 0.412797
O  1.457106 -4.89671 -0.437017
O  5.416378 1.925774 0.49634
O  3.817418 3.749687 -0.416115
O  -3.06895 -3.548002 0.251291
O  0.953662 -3.487769 1.891927
O  -3.866551 3.702761 -0.497999
O  3.115332 2.56681 2.038528
C  -0.96386 -0.366108 -0.41064
C  0.173358 -1.296991 0.050869
C  -0.788528 1.05196 0.154867
C  1.756875 0.599851 0.242782
C  1.529491 -0.765988 -0.436054
C  0.640304 1.598277 -0.127445
H  -0.995758 -0.315279 -1.513783
H  -1.003738 1.049966 1.24342
H  0.195461 -1.369674 1.156779
H  1.826891 0.47595 1.342918
H  0.702079 1.826532 -1.204866
H  2.341598 -1.455063 -0.134177
H  1.358403 2.78221 1.430868
H  2.356308 -0.405437 -2.232353
H  -1.283945 -2.62438 -2.077382
H  -5.252629 -2.281325 -0.917646
H  -1.944564 -4.466582 0.422948
H  1.070283 -5.712747 -0.849222
H  -3.795071 2.023531 1.918381
H  -0.441893 3.866587 0.634503
H  2.949253 4.230154 -0.475074
H  6.065454 2.670535 0.417049
