program: Gaussian 09
title: 000107664
version: EM64L-G09RevD.01
frameworkgroup: C1[X(C18H18O2)]
method: RPBEPBE
basis: SDD
operation: Freq
keyword: #pfreq=noraman
keyword: PBEPBE/SDD
title: #p freq=noraman PBEPBE/SDD
converged: YES YES NO NO
title: Mulliken charges:
elementType: O O C C C C C C C C C C C C C C C C C C H H H H H H H H H H H H H H H H H H
charge: -0.435782 -0.432786 -0.399318 0.154813 0.381027 0.168518 0.156743 -0.550538 -0.711115 0.319500 -0.631086 -0.399814 0.290845 -0.380812 -0.695967 -0.369232 -0.374663 -0.417911 -0.377687 0.278490 0.229132 0.243941 0.219485 0.232690 0.214022 0.241756 0.233751 0.243874 0.248136 0.219652 0.217011 0.233131 0.243620 0.232166 0.219030 0.249400 0.351861 0.354117
chargesum: 0.00000
title: Mulliken charges with hydrogens summed into heavy atoms:
elementType: O O C C C C C C C C C C C C C C C C C C
charge: -0.083922 -0.078669 -0.170186 0.154813 0.381027 0.168518 0.156743 -0.087112 -0.022647 0.319500 -0.397335 -0.155941 0.290845 -0.132676 -0.026173 -0.125613 -0.142497 -0.198881 -0.128286 0.278490
polarizability: 3.68126310e+02 -7.65140469e+00 2.04169036e+02 4.23212246e+00 5.04523096e+00 1.07147327e+02
1716.lowfreq: -9.1457 -0.0009 -0.0007 0.0004 4.1734 7.6384 39.4912 51.7795 68.6223
frequency: 39.4784 51.7594 68.6156 87.3740 95.6559 115.1269 131.7664 181.4436 188.7688 216.9068 226.0727 237.2712 244.0305 290.4000 308.6364 327.0967 336.5232 357.2674 363.4289 375.9233 402.8778 414.2841 442.8749 471.0083 479.9715 515.5805 551.0752 568.5216 589.1229 628.6473 637.6055 655.8197 679.8956 730.5301 735.6744 761.1979 762.2700 798.1118 809.7547 826.4420 831.7686 837.9297 848.9287 888.3213 935.2499 936.1294 946.2738 957.1062 969.5315 997.3387 1008.2165 1045.7629 1052.1700 1063.5944 1092.6584 1097.0339 1119.7000 1128.6857 1131.7709 1146.5683 1162.0130 1184.3249 1210.6672 1225.4654 1245.6171 1249.9836 1261.5237 1285.2628 1302.9233 1311.1068 1315.8371 1357.7177 1375.5053 1389.1368 1391.2150 1416.8433 1425.0243 1445.0771 1470.5611 1472.4477 1475.0612 1479.4724 1480.5335 1492.3674 1503.6864 1577.7566 1595.1184 1603.5457 1621.6098 1624.7600 2953.5874 2976.4397 2978.7590 2983.8016 3039.8496 3073.2889 3079.3623 3081.9503 3089.6474 3102.1422 3111.0987 3133.2511 3135.2599 3165.6498 3169.8964 3170.0075 3581.5217 3582.9036
redmass: 5.0048 3.8616 4.7281 3.6145 3.2319 3.4988 4.5820 3.9754 1.1044 3.7228 3.3279 2.9794 1.3997 2.4411 4.4396 4.0834 1.1593 1.1154 4.0980 4.1718 3.8907 3.0017 3.1041 4.4648 5.4900 2.8962 4.3290 3.8885 4.2814 4.6341 6.4822 3.3370 4.0460 4.4196 3.5608 2.8225 2.4500 2.2870 1.6511 1.4975 1.7560 1.8686 1.5241 2.9701 2.4804 1.3715 1.3504 1.3602 2.4199 2.6438 2.1797 2.0080 2.3044 1.6556 1.8440 1.8188 1.5864 2.0465 1.6994 1.3538 1.2307 1.1240 1.7027 1.7798 1.4329 2.2800 1.4596 2.8190 1.7198 1.8358 1.4043 3.2041 3.9810 1.2095 1.2592 4.1793 3.6648 3.7025 2.1461 1.0826 1.2100 1.0829 1.0949 1.1246 2.6852 6.5129 7.5331 7.3586 6.6352 6.8151 1.0810 1.0639 1.0352 1.0347 1.0960 1.1004 1.0999 1.1001 1.1009 1.0914 1.0898 1.0893 1.0884 1.0933 1.0953 1.0953 1.0660 1.0660
irintensity: 0.1299 0.5931 0.9872 1.9942 0.0594 0.3215 0.4253 0.2884 0.0319 0.1271 0.0454 0.3089 0.1031 1.1930 0.1851 1.6876 135.6977 143.1902 7.3818 11.8665 7.2154 1.0747 21.5174 1.5306 32.8511 16.9775 5.1782 8.9237 6.0833 4.4096 2.8358 8.2226 4.0413 10.8057 0.2616 9.3323 7.2554 20.5807 18.7644 29.7313 26.4136 32.8900 29.4080 11.3925 19.3828 2.0779 0.1431 0.3757 1.6202 3.2045 0.0220 15.7592 1.4182 10.4487 6.1183 37.3854 67.6777 71.4639 233.4128 207.8497 69.8966 4.5919 1.6492 24.3720 2.8704 48.0959 0.6826 9.7925 4.5607 17.7204 3.1568 20.0421 22.9453 10.4564 20.8949 5.4088 2.4159 85.9309 47.0699 13.9349 12.8728 5.4731 8.5521 18.2687 134.2917 21.6589 8.8517 3.4279 6.4941 106.9044 13.2271 32.6936 36.8174 32.1602 6.8753 51.6801 23.0284 42.7864 22.3761 24.3108 27.5087 10.4638 12.7568 15.0002 14.6639 1.7949 72.9231 42.5539
temp: 298.150 k
press: 1.00000 atm
elementType: 8 8 6 6 6 6 6 6 6 6 6 6 6 6 6 6 6 6 6 6 1 1 1 1 1 1 1 1 1 1 1 1 1 1 1 1 1 1
symmnumber: 1
zpe: 808078.2 jmol-1
zpe.correction: 0.307781 hartree
zpe.thermalcorrener: 0.326138 hartree
zpe.thermalcorrenthalpy: 0.327082 hartree
zpe.thermalcorrgfe: 0.261993 hartree
zpe.sumelectzpe: -845.737140 hartree
zpe.sumelectthermal: -845.718783 hartree
zpe.sumelectthermalent: -845.717838 hartree
zpe.sumelectthermalfe: -845.782927 hartree
dipole: 1.3065 0.0955 0.9559
dipole: 1.6217
quadrupole: -119.7083 -101.4262 -122.8729
quadrupole: 16.6202 3.7622 1.1775
quadrupole: -5.0392 13.2429 -8.2038 16.6202 3.7622 1.1775
hfenergy: -846.0449204 hartree
pointgroup: C01 [X(C18H18O2)]
dipole: -0.5105472 -0.0547233 -0.3786926 debye
polarizability: 367.590684|12.5180741|198.2508374|4.6688245|-24.4725973|113.601151 unknown
InChI: InChI=1S/C18H18O2/c1-3-15-16-9-8-14(20)10-17(16)11(2)18(15)12-4-6-13(19)7-5-12/h4-11,19-20H,3H2,1-2H3
charge 0 multiplicity 1
38 atoms
O  5.661274 -1.065459 0.30374
O  -6.067677 -0.674411 0.213497
C  0.547754 -1.297341 0.21189
C  -0.360107 -0.056129 0.093712
C  1.945995 -0.697776 0.188903
C  0.415202 1.094143 0.014777
C  1.84187 0.717959 0.068473
C  -0.024837 2.539821 -0.056372
C  0.311764 -2.345086 -0.909424
C  -1.829044 -0.181823 0.100467
C  3.19553 -1.330575 0.269409
C  3.01309 1.512953 0.038612
C  4.362335 -0.520999 0.230661
C  4.275807 0.887903 0.119465
C  0.106632 3.153857 -1.478376
C  -2.678961 0.702569 -0.626559
C  -2.464875 -1.23262 0.831809
C  -4.081663 0.566695 -0.606333
C  -3.862396 -1.380856 0.862339
C  -4.676677 -0.474773 0.145095
H  0.378682 -1.794206 1.191734
H  -1.06646 2.641939 0.297388
H  0.601886 3.135114 0.638031
H  0.501137 -1.896042 -1.900301
H  0.986777 -3.211734 -0.786779
H  -0.729217 -2.712902 -0.890172
H  3.277131 -2.422123 0.363277
H  2.95505 2.604018 -0.043845
H  5.204188 1.466294 0.097478
H  -0.187609 4.21946 -1.474002
H  -0.533751 2.622739 -2.206256
H  1.145897 3.085785 -1.84652
H  -2.236411 1.483852 -1.250854
H  -1.852432 -1.93425 1.408811
H  -4.705818 1.260086 -1.185683
H  -4.338765 -2.18212 1.435001
H  5.622781 -2.051295 0.374864
H  -6.547283 0.011433 -0.314057
