program: Gaussian 09
title: 000107630
version: EM64L-G09RevD.01
frameworkgroup: C1[X(C11H14O)]
method: RPBEPBE
basis: SDD
operation: Freq
keyword: #pfreq=noraman
keyword: PBEPBE/SDD
title: #p freq=noraman PBEPBE/SDD
converged: YES YES NO NO
title: Mulliken charges:
elementType: O C C C C C C C C C C C H H H H H H H H H H H H H H
charge: -0.268014 -0.543661 0.379845 -0.462090 -0.411662 0.339588 -0.387591 -0.135401 -0.788312 -0.224841 -0.076369 -0.594421 0.222139 0.224407 0.217261 0.210344 0.252481 0.251657 0.215022 0.243844 0.237498 0.233079 0.225300 0.213606 0.212353 0.213938
chargesum: 0.00000
title: Mulliken charges with hydrogens summed into heavy atoms:
elementType: O C C C C C C C C C C C
charge: -0.268014 -0.097115 0.379845 -0.034485 -0.159180 0.339588 -0.135935 0.079621 -0.073891 0.000459 0.137237 -0.168130
polarizability: 1.26938095e+02 2.24342202e+01 1.44143463e+02 -6.28251426e-01 5.72599036e+00 1.01993674e+02
1716.lowfreq: -5.0325 -0.0008 -0.0006 -0.0004 4.1186 11.9582 25.5492 30.7522 60.0267
frequency: 25.5196 30.5224 59.9855 105.2112 124.2387 137.6476 172.4952 214.6837 230.0024 260.3940 310.7377 378.2784 413.0683 443.4578 495.3958 585.4706 610.7823 641.3665 658.1901 683.0443 798.3221 825.4092 846.0342 852.1432 910.0436 912.7697 925.9842 932.2443 947.4455 957.5265 989.4476 999.3775 1017.1278 1025.8399 1048.1609 1073.5607 1134.9647 1169.6604 1203.9085 1206.4133 1215.2562 1237.7430 1267.0354 1280.6038 1299.5609 1316.8715 1336.9265 1347.1014 1403.7761 1430.2483 1451.2755 1456.3175 1456.7620 1473.2265 1572.7785 1610.0520 1615.7049 1668.1987 2955.8326 2979.6549 2992.2934 3034.3947 3055.1640 3056.4079 3077.6614 3080.9478 3092.4555 3098.3333 3100.4070 3202.3692 3212.1893 3231.5840
redmass: 4.3547 3.7377 2.1662 2.4550 1.2521 2.4223 3.4760 2.5546 3.0398 2.1416 3.0379 2.4322 2.3106 3.5173 2.5645 3.9203 3.6691 1.5999 3.0099 3.3733 1.2096 1.7464 2.1214 1.3912 2.6776 3.1369 1.3347 1.9581 2.8875 1.2663 1.8933 2.0568 1.1084 1.2816 1.4527 1.8278 1.8060 1.8277 1.8144 2.2242 1.8353 1.7894 1.3247 1.4235 1.2592 1.4061 1.5093 2.3012 1.2460 1.2477 1.0960 1.0439 1.1082 1.0908 7.6870 6.2263 4.2418 5.8158 1.0636 1.0376 1.0612 1.0957 1.0984 1.1005 1.0931 1.0815 1.0753 1.0836 1.0974 1.1144 1.0938 1.1039
irintensity: 0.0935 0.0654 0.0021 1.8353 0.6305 2.5605 1.3967 4.3645 2.4505 1.3362 0.7932 1.6348 2.8245 0.4937 0.6059 0.9558 0.3845 3.4909 0.3193 0.2453 72.7506 8.8751 4.6903 0.7016 14.4793 4.3936 36.5974 15.4154 3.6027 44.5438 10.2174 3.6880 61.4455 33.7113 5.3235 2.4309 8.6432 12.5588 5.1001 0.7251 11.4425 3.4958 0.6248 0.7177 3.1969 1.4960 3.2317 1.4721 7.9019 3.9850 15.0763 13.9922 12.1313 13.0051 21.1383 11.0444 10.3582 18.5803 45.9517 32.8099 39.3952 17.0285 18.0366 22.7879 12.9228 0.3145 40.7425 15.8952 16.3916 26.2432 8.2445 1.4683
temp: 298.150 k
press: 1.00000 atm
elementType: 8 6 6 6 6 6 6 6 6 6 6 6 1 1 1 1 1 1 1 1 1 1 1 1 1 1
symmnumber: 1
zpe: 568022.9 jmol-1
zpe.correction: 0.216348 hartree
zpe.thermalcorrener: 0.229201 hartree
zpe.thermalcorrenthalpy: 0.230145 hartree
zpe.thermalcorrgfe: 0.175279 hartree
zpe.sumelectzpe: -501.840316 hartree
zpe.sumelectthermal: -501.827464 hartree
zpe.sumelectthermalent: -501.826520 hartree
zpe.sumelectthermalfe: -501.881386 hartree
dipole: -0.6515 -0.3533 0.1745
dipole: 0.7614
quadrupole: -75.5261 -64.2343 -68.7696
quadrupole: -0.6485 -2.4451 -0.9238
quadrupole: -6.0161 5.2757 0.7404 -0.6485 -2.4451 -0.9238
hfenergy: -502.0566647 hartree
pointgroup: C01 [X(C11H14O1)]
dipole: -0.2556008 0.1384513 -0.0723978 debye
dipolederiv: -0.35937 -0.0637535 -0.2033036 -0.1105525 -0.4865908 0.0729058 -0.244835 0.0697473 -0.4547727 0.1074611 -0.068071 -0.0292914 0.0810896 0.093127 0.0170326 -0.0554728 0.1097495 0.1585639 0.1390003 0.0415093 0.2013816 0.1356038 0.2136148 -0.0418613 0.2299476 -0.167458 0.1746541 0.0697351 0.067001 0.0159366 0.062258 0.0125364 0.0196774 0.0421679 -0.1068379 0.0727636 -0.2179965 0.0064812 0.0419045 0.0055099 -0.022397 -0.0516967 0.0077353 -0.0727391 -0.1285682 0.1156066 0.0578217 0.1755322 0.081409 0.3533851 -0.1044311 0.1723174 -0.078705 0.264012 -0.1721687 0.0954724 0.0575129 0.0233974 -0.1037849 0.0385117 0.0704157 0.0832984 -0.1640949 -0.0727369 -0.1849221 -0.0103245 -0.302727 -0.0035518 -0.0262906 0.0412092 0.0127187 0.1460721 0.0773879 0.0304622 -0.037396 -0.0368721 -0.0566198 0.020576 -0.0161141 0.0972291 0.0449539 -0.1951136 -0.0146327 0.0097861 0.025827 -0.1066458 -0.0078712 0.0231907 -0.0712307 0.0793153 0.0891347 -0.1992368 -0.0398068 -0.2477526 0.1628498 0.0282872 0.0915169 -0.0765023 0.1264731 -0.431242 -0.0829126 0.059835 -0.0466847 -0.3165562 -0.1108775 0.0489157 -0.1005303 0.0727618 0.0581453 -0.0563578 -0.023191 -0.0559561 0.0620312 0.0155471 -0.0009674 -0.0602045 -0.1318455 -0.0678073 0.1126935 -0.0187286 0.0648807 -0.1133318 0.0155747 -0.0434015 0.0707294 0.0709678 0.0261589 0.0402006 0.007956 0.0347377 0.078883 -0.0275141 -0.0021136 0.0570602 -0.1422612 -0.0656905 -0.0724733 -0.0195023 -0.0309367 -0.203909 -0.0709776 -0.0734637 -0.0522772 0.0782319 0.169116 0.0090293 -0.0481475 0.0188316 0.0091015 0.0975527 -0.0490374 0.0932201 0.0716207 0.0955935 -0.0764581 -0.0919899 -0.0935592 0.0571185 -0.0503886 -0.1019004 -0.0488346 0.0918162 0.1178386 0.0583767 -0.0018657 0.0801031 0.0699012 0.0436047 -0.0256907 0.042847 -0.1206566 -0.0744011 0.1199983 -0.0189545 0.0431988 -0.0030072 0.0427388 0.0075452 0.0282325 0.0937199 0.0841204 -0.0208156 0.0784445 0.0061571 0.0304605 -0.0004737 0.0914918 0.071699 -0.1194053 0.0294443 -0.1024367 -0.0681376 -0.0681759 0.0025569 -0.0269221 -0.0951063 -0.0895224 0.0358077 0.1173383 0.0629147 -0.0126599 0.0627735 0.0707298 0.0223092 -0.0402395 0.0536787 -0.1117447 0.1222521 0.0483831 0.028334 0.0597217 0.0804101 -0.0131439 -0.0411907 0.0552248 -0.1304073 0.080148 0.1331542 -0.0324804 0.14674 0.0066638 0.052938 -0.0397602 0.0626682 0.0433552 0.1580454 0.058572 -0.0208437 0.0609782 0.1130248 0.0451925 0.0028399 0.016739 -0.1213325 unknown
polarizability: 126.7151796|-22.3254774|144.6333773|1.2470619|4.6069512|101.7266751 unknown
InChI: InChI=1S/C11H14O/c1-3-4-5-6-7-11-9-8-10(2)12-11/h3-5,8-9H,1,6-7H2,2H3
charge 0 multiplicity 1
26 atoms
O  -1.259156 -0.213949 0.775419
C  -0.615461 2.167518 0.492553
C  -1.39812 0.980033 0.02379
C  0.863468 2.21167 -0.02281
C  -2.245716 0.737526 -1.045542
C  -2.042051 -1.207941 0.14035
C  -2.654976 -0.6530 -0.971583
C  1.714588 1.073871 0.486475
C  -2.037196 -2.563567 0.769054
C  2.414855 0.203125 -0.299731
C  3.232891 -0.891725 0.224929
C  3.942419 -1.769828 -0.542656
H  -0.609938 2.189345 1.5996
H  -1.130812 3.085087 0.15296
H  0.864408 2.222669 -1.129013
H  1.294826 3.17843 0.314602
H  -2.547068 1.46488 -1.797461
H  -3.32173 -1.173542 -1.656522
H  1.75273 0.947203 1.580369
H  -1.017004 -2.989445 0.80119
H  -2.417487 -2.532849 1.80723
H  -2.67764 -3.247422 0.187951
H  2.36985 0.311446 -1.394127
H  3.261668 -0.995556 1.320566
H  4.538408 -2.573261 -0.097212
H  3.941045 -1.703418 -1.637881
