program: Gaussian 09
title: 000107627
version: EM64L-G09RevD.01
frameworkgroup: C1[X(C17H19N5O6S)]
method: RPBEPBE
basis: SDD
operation: Freq
keyword: #p
keyword: freq=noraman
keyword: PBEPBE/SDD
title: #p freq=noraman PBEPBE/SDD
converged: YES YES NO NO
title: Mulliken charges:
elementType: S O O O O O O N N N N N C C C C C C C C C C C C C C C C C H H H H H H H H H H H H H H H H H H H
charge: 0.969365 -0.305969 -0.421532 -0.482170 -0.377664 -0.533445 -0.491606 -0.182672 -0.086662 -0.045919 -0.064122 -0.611507 -0.174841 -0.187633 -0.038157 -0.014662 -0.323400 0.158438 -0.238386 -0.103385 0.160704 -0.028210 -0.369116 -0.270533 -0.201057 -0.367009 -0.378355 0.457517 -0.797630 0.281954 0.240136 0.280745 0.252442 0.249181 0.225198 0.370757 0.365109 0.336243 0.241759 0.292740 0.328680 0.344379 0.330872 0.247637 0.251125 0.244572 0.230973 0.235118
chargesum: 0.00000
title: Mulliken charges with hydrogens summed into heavy atoms:
elementType: S O O O O O O N N N N N C C C C C C C C C C C C C C C C C
charge: 0.969365 -0.305969 -0.050776 -0.117061 -0.377664 -0.533445 -0.491606 -0.182672 -0.086662 -0.045919 -0.064122 0.063744 0.107114 0.052503 0.242588 0.237779 0.150979 0.158438 0.097857 -0.103385 0.160704 -0.028210 -0.127357 0.022206 0.127623 -0.119371 -0.127230 0.457517 -0.086968
polarizability: 2.84909344e+02 1.28425446e+01 3.03427156e+02 -2.77767563e+01 -2.50126249e+00 2.14487895e+02
1716.lowfreq: -8.6163 -8.0694 -0.0008 -0.0006 -0.0003 2.9022 12.3372 25.0211 33.5731
frequency: 11.5421 24.8019 33.5053 37.8878 40.5137 46.8002 54.9598 64.5468 78.9085 83.6051 104.1965 126.1165 143.6907 156.5276 160.9713 178.7486 203.1507 214.1054 226.6466 234.1232 246.8590 255.3138 271.1465 272.4748 273.8347 296.3966 314.9468 326.1857 354.8272 380.6730 391.0993 404.2560 407.4101 444.2975 477.4603 493.5195 505.8629 509.3151 510.5123 524.2605 541.3393 547.6059 564.0236 570.4920 589.4535 604.5273 619.5913 634.6603 648.2849 668.4058 692.9545 700.1528 703.8975 774.4064 798.1510 806.4263 822.7580 825.9362 831.2453 853.0692 855.4437 862.6063 874.0386 924.2970 927.8871 931.1659 953.2662 959.1936 967.6512 971.2867 987.0079 990.7354 993.2316 997.7401 1026.6979 1037.7635 1048.4928 1049.4220 1058.3550 1071.0776 1093.3385 1123.9393 1126.7539 1157.9232 1193.2720 1195.8110 1217.5086 1219.3057 1235.8396 1238.3906 1245.0584 1255.2338 1268.1547 1280.8664 1303.2808 1308.5676 1314.0261 1320.1710 1331.3232 1357.1516 1360.6063 1366.8893 1376.6602 1381.8485 1385.7591 1394.6689 1399.0096 1409.0593 1428.1034 1435.7512 1466.5457 1469.4610 1473.5069 1475.5834 1544.4804 1577.7731 1590.0193 1590.7731 1631.1477 2952.9501 2982.0592 3012.2020 3018.3305 3021.0075 3035.4767 3065.1008 3065.3384 3095.7709 3132.5322 3141.2263 3149.7768 3164.8709 3168.8213 3204.6429 3496.4265 3540.8790 3609.8539 3696.4519
redmass: 6.0833 6.2218 1.1664 2.8821 5.5882 6.2014 5.9027 6.8284 5.2373 6.4147 6.3789 7.5896 6.7375 6.2719 5.9373 9.8241 6.3392 1.3892 7.8649 3.9558 5.2061 3.6723 5.9255 5.6987 4.2162 5.0621 4.0143 5.7380 4.5435 4.9898 5.6067 4.0360 3.0380 4.4084 4.3388 1.3158 3.5885 1.6027 3.3382 4.2791 4.5221 1.0743 4.0696 4.9822 6.3660 5.6735 6.9660 6.8410 5.4142 8.7810 5.2573 3.4261 6.4294 4.7527 9.2295 4.2147 5.2120 7.0671 1.4172 5.6723 1.3839 1.6601 2.3000 4.9212 1.4974 6.9041 11.5663 2.4876 2.0664 1.3323 5.8268 1.4572 4.2158 1.3696 3.4154 2.9076 2.3785 1.6369 4.1366 3.1674 3.4025 3.9777 1.3254 1.3337 2.0085 1.2686 1.4865 3.0982 1.3232 1.6079 1.3096 1.2938 1.9081 1.7537 2.1591 1.2830 2.6258 2.8285 1.7067 1.3905 1.9277 1.3100 1.2532 6.8197 3.5856 2.6862 1.2236 1.4625 1.0914 2.8151 3.9784 1.1120 1.8369 1.1639 7.8460 1.8528 6.3447 6.1712 2.8357 1.0583 1.0393 1.0888 1.0901 1.0874 1.0960 1.0874 1.0943 1.1002 1.0912 1.0897 1.0970 1.0920 1.0961 1.1014 1.0646 1.0441 1.0672 1.1056
irintensity: 0.7185 0.6061 0.4620 0.3855 0.6481 5.0357 2.7035 3.1765 0.6557 0.9181 1.4572 1.1684 1.2141 3.4471 3.6416 0.3547 2.5078 121.6720 14.9795 28.3948 9.4671 14.7208 9.0270 7.1871 7.3295 7.3529 3.3409 3.2948 3.0891 2.8007 32.0065 2.4258 1.3951 11.3792 32.5448 155.4322 60.0963 182.8157 62.3823 75.8501 26.8556 4.5605 0.2491 6.5200 31.0639 12.7328 3.2092 10.0106 45.5192 1.3685 48.6660 1.6483 0.4851 4.9624 6.8664 24.0849 54.2236 73.1995 26.9642 3.3211 9.9193 48.5268 13.9747 164.3792 28.5840 110.3900 96.6111 11.9286 19.9285 6.7915 1.6158 2.6709 59.8471 1.6458 23.4378 51.6084 24.7212 14.7028 139.1656 3.8211 11.8710 12.7599 2.2902 35.6362 19.6362 13.9413 16.4112 4.4322 19.9648 75.2901 29.8834 1.0945 54.6013 91.5054 25.4048 2.1316 17.7713 9.0191 16.3200 5.9785 52.1688 8.7283 40.6878 2.7044 23.9736 13.4854 17.6349 6.9637 18.8439 85.9783 50.1497 17.9186 23.2656 13.4221 70.5905 34.0662 12.6208 6.0720 598.6523 33.1061 19.4673 19.6461 17.9358 3.8170 46.9478 14.3933 16.4844 13.5503 49.8068 6.9099 21.2837 18.6762 7.7277 49.2009 40.7533 118.9679 27.1354 48.4135
temp: 298.150 k
press: 1.00000 atm
elementType: 16 8 8 8 8 8 8 7 7 7 7 7 6 6 6 6 6 6 6 6 6 6 6 6 6 6 6 6 6 1 1 1 1 1 1 1 1 1 1 1 1 1 1 1 1 1 1 1
symmnumber: 1
zpe: 934690.3 jmol-1
zpe.correction: 0.356005 hartree
zpe.thermalcorrener: 0.383776 hartree
zpe.thermalcorrenthalpy: 0.384720 hartree
zpe.thermalcorrgfe: 0.295047 hartree
zpe.sumelectzpe: -1780.054640 hartree
zpe.sumelectthermal: -1780.026869 hartree
zpe.sumelectthermalent: -1780.025925 hartree
zpe.sumelectthermalfe: -1780.115598 hartree
dipole: -2.6519 0.1148 -3.8862
dipole: 4.7062
quadrupole: -193.9644 -133.2255 -178.6594
quadrupole: -13.2902 13.7251 12.5511
quadrupole: -25.3479 35.3909 -10.0430 -13.2902 13.7251 12.5511
hfenergy: -1780.4106449 hartree
pointgroup: C01 [X(C17H19N5O6S1)]
dipole: 1.1418881 -0.2979447 1.4267679 debye
polarizability: 277.0090852|-4.8240323|304.2224733|-32.1726779|17.6983702|221.5928371 unknown
InChI: InChI=1S/C17H19N5O6S/c1-9-2-4-10(5-3-9)29(25,26)27-6-11-13(23)14(24)17(28-11)22-8-21-12-15(18)19-7-20-16(12)22/h2-5,7-8,11,13-14,17,23-24H,6,18H2,1H3
charge 0 multiplicity 1
48 atoms
S  2.981425 -1.332286 -1.629596
O  0.023443 -1.55194 0.623365
O  -3.371408 -2.722348 -0.274576
O  -1.839152 -4.021282 1.478133
O  2.550389 -2.668295 -0.332264
O  1.592218 -1.032463 -2.424781
O  4.272065 -1.811614 -2.473475
N  -1.608864 0.001661 -0.166242
N  -1.478461 1.738404 -1.660266
N  -3.128323 1.030513 1.516293
N  -3.807352 3.306795 0.871122
N  -3.079189 4.34779 -1.12359
C  -1.948286 -2.513175 -0.360199
C  -1.112754 -3.671746 0.246674
C  -1.430324 -1.293315 0.457443
C  0.265208 -3.022699 0.528788
C  1.266923 -3.323071 -0.600031
C  -2.413149 1.027141 0.356242
C  -1.070279 0.488804 -1.378002
C  -2.325458 2.082661 -0.587376
C  -3.071561 3.260646 -0.291227
C  3.476841 0.052228 -0.471443
C  -3.792086 2.213018 1.694133
C  4.767151 0.581377 -0.635389
C  2.550563 0.503987 0.482391
C  5.138773 1.649817 0.208997
C  2.956425 1.572218 1.31089
C  4.245367 2.158889 1.188798
C  4.669317 3.288122 2.108567
H  -1.715644 -2.37773 -1.429598
H  -1.045627 -4.54423 -0.431199
H  -1.935313 -1.247977 1.441399
H  0.677152 -3.352624 1.50054
H  0.860386 -2.975139 -1.57324
H  1.468047 -4.411233 -0.656638
H  -3.552341 -3.135591 0.613111
H  -1.482525 -4.851204 1.877057
H  -0.348791 -0.080772 -1.963362
H  -4.388595 2.298901 2.607232
H  5.448363 0.176098 -1.389818
H  1.56866 0.030281 0.591947
H  -2.545626 4.325194 -1.989965
H  -3.634954 5.161192 -0.868367
H  6.13575 2.091612 0.102301
H  2.258007 1.951099 2.065383
H  5.111586 2.887485 3.04125
H  5.428704 3.934278 1.635939
H  3.811396 3.918925 2.39825
