program: Gaussian 09
title: 000107625
version: EM64L-G09RevD.01
frameworkgroup: C1[X(C21H31N3O4)]
method: RPBEPBE
basis: SDD
operation: Freq
keyword: #p
keyword: freq=noraman
keyword: PBEPBE/SDD
title: #p freq=noraman PBEPBE/SDD
converged: YES YES NO NO
title: Mulliken charges:
elementType: O O O O N N N C C C C C C C C C C C C C C C C C C C C C H H H H H H H H H H H H H H H H H H H H H H H H H H H H H H H
charge: -0.436458 -0.191500 -0.435091 -0.189771 -0.043916 -0.012386 -0.064805 -0.118099 -0.167464 0.288517 -0.285550 0.389012 -0.004359 0.121315 -0.587430 -0.494983 -0.655382 -0.164599 -0.500640 0.132474 -0.514692 -0.530195 -0.820898 -0.861929 -0.472862 -0.083460 0.103060 -0.774443 0.271021 0.261175 0.224301 0.187037 0.240071 0.235897 0.217366 0.206603 0.239122 0.296638 0.212840 0.200658 0.212505 0.195834 0.262497 0.212135 0.195317 0.258609 0.252352 0.215055 0.270756 0.213818 0.210230 0.195544 0.221117 0.217080 0.345608 0.234509 0.292593 0.258800 0.319444
chargesum: 0.00000
title: Mulliken charges with hydrogens summed into heavy atoms:
elementType: O O O O N N N C C C C C C C C C C C C C C C C C C C C C
charge: -0.090850 -0.191500 -0.115647 -0.189771 -0.043916 -0.012386 -0.064805 0.152922 0.093710 0.288517 -0.061249 0.389012 0.182677 0.121315 -0.111462 -0.071014 -0.119623 0.048242 -0.087477 0.132474 -0.056362 -0.122743 -0.094882 -0.167125 -0.056201 0.133620 0.103060 0.011460
polarizability: 2.97620538e+02 -1.90424658e+00 2.41585644e+02 6.18109941e+00 -1.11522153e+01 2.10808343e+02
1716.lowfreq: -23.4789 -12.2472 -5.5549 -0.0009 -0.0006 0.0005 10.0287 20.4000 31.8753
frequency: -23.2456 20.0164 31.7635 50.3762 86.3544 87.6889 91.3792 113.2068 117.1176 135.3042 148.8868 159.7747 163.5899 177.6279 185.0041 197.0366 199.3008 216.2926 219.8007 230.7872 248.1991 259.5858 260.8927 270.3861 285.5830 290.5555 302.1336 316.9450 328.1510 340.7952 360.4764 364.2982 376.3446 392.8535 402.3971 423.9336 440.4273 450.3876 462.8564 468.2230 482.6569 485.0528 514.5654 526.1499 537.9632 555.1245 567.1360 594.4566 618.6297 626.6769 647.3661 672.9665 708.8162 731.2097 789.9844 796.5724 803.1815 830.0697 860.7950 871.5729 884.5794 899.6454 907.3577 918.3881 923.2344 937.9226 948.5200 952.9594 970.6444 975.4750 982.2286 999.1728 1008.9881 1016.8517 1022.4300 1027.6942 1042.0657 1047.7261 1061.0541 1072.5280 1078.5978 1079.3869 1100.0743 1108.5375 1116.5644 1125.2415 1136.4803 1141.4263 1143.8189 1157.1776 1168.6782 1178.6466 1184.3476 1197.9185 1207.1772 1215.7442 1220.8602 1226.1203 1233.9684 1246.7142 1249.4141 1252.7240 1262.1449 1271.5621 1278.7867 1281.8673 1286.5143 1308.4852 1310.9223 1313.4171 1319.3512 1327.7415 1338.1511 1340.1067 1344.4404 1350.2002 1351.4419 1356.5278 1362.8722 1372.4358 1375.7350 1378.6994 1387.4942 1398.5259 1444.8958 1448.7761 1449.6099 1458.9840 1462.2055 1462.9335 1464.7298 1473.3607 1478.6191 1480.4386 1487.9668 1489.2952 1497.9859 1610.3282 1616.6944 2028.8234 2897.0052 2904.4513 2951.6684 2952.2037 2957.3499 2961.2820 2965.7054 2969.6335 2974.7129 2977.4282 2983.3774 2991.2763 2992.5827 2995.3337 2995.8048 3015.5556 3018.6314 3030.2831 3035.8249 3048.5959 3061.3469 3067.4006 3068.6791 3074.5206 3080.8429 3088.7119 3095.9708 3099.1248 3124.2696 3541.4500 3568.7518
redmass: 3.9935 10.6244 6.5550 4.8112 3.8534 4.7449 3.3763 6.8963 6.7474 2.3546 2.2726 1.1488 1.7660 3.4113 1.5304 1.1670 3.7117 2.2651 4.7729 2.5377 1.9414 3.1984 3.6384 2.6224 1.9244 2.9351 3.2285 4.0088 2.9328 3.8514 2.7472 3.2943 3.8344 3.6523 3.8412 2.9505 2.7233 2.1238 10.9589 3.8925 2.8074 3.8703 2.3491 2.9011 4.5003 3.2814 3.5432 3.0574 3.2997 2.9709 3.9694 4.2180 3.9634 3.0408 2.0910 2.9319 2.0007 2.6409 2.8702 2.0715 1.9691 2.7702 2.8727 2.3758 2.6453 1.9219 1.9369 1.8948 2.1434 2.3836 2.0748 2.0561 2.2800 1.9516 2.0399 2.2283 2.0774 3.1785 2.1487 2.9492 2.2181 2.5127 1.9340 2.0435 2.1463 1.5106 2.0817 1.8793 1.5635 1.8255 1.6388 1.8964 1.9363 2.1961 2.9485 1.5486 1.6265 1.9044 1.4833 4.9721 1.7137 1.6000 1.5724 1.4056 1.5057 1.4298 1.4190 1.3330 1.3424 1.5726 1.2746 1.3801 1.4236 1.4123 1.3670 1.4845 1.4419 1.4002 1.5015 1.2903 1.1973 1.3540 1.2321 1.1913 1.0638 1.0827 1.0734 1.0838 1.0848 1.0833 1.0827 1.0835 1.0555 1.0948 1.0599 1.0578 1.0580 8.4585 9.1208 13.9502 1.0798 1.0807 1.0638 1.0685 1.0815 1.0798 1.0624 1.0642 1.0614 1.0407 1.0802 1.0427 1.0399 1.0568 1.0629 1.0867 1.0955 1.1006 1.0984 1.0975 1.1022 1.0913 1.0926 1.0967 1.0981 1.0991 1.0988 1.0977 1.1023 1.0658 1.0663
irintensity: 3.2672 0.6954 0.2954 0.2067 2.1503 1.2254 2.1142 8.0608 0.9154 2.3673 1.7908 4.1993 0.7493 10.1978 4.1797 113.0273 5.8815 7.7010 0.1910 4.9955 10.6925 5.0891 3.2905 6.4371 55.3591 2.9634 1.7525 2.3260 34.6895 3.7084 0.1420 8.1999 0.6368 4.7407 1.6572 5.8999 3.6150 2.6119 5.2403 0.7769 5.2628 0.1697 6.0277 5.1446 3.5131 12.1751 8.9441 6.1549 9.0774 11.5467 7.4323 5.9627 3.7025 1.1583 1.7275 2.2112 3.7987 17.9301 1.8603 6.6523 8.8789 51.0613 7.2826 13.4743 11.9413 10.0210 11.8912 22.5614 22.2908 2.2262 4.1708 49.6331 45.4394 3.4521 18.0635 0.8616 6.1948 18.2790 4.5420 52.8321 16.1017 1.3351 5.7300 51.2060 0.8332 11.1247 5.5455 20.2640 4.5306 1.6903 17.5659 7.8195 4.4734 6.9346 81.7123 12.4069 10.7191 38.7230 6.4534 58.5487 26.9853 5.3807 35.4547 14.8562 5.6419 3.2536 11.0670 0.9990 28.3780 8.8677 3.7331 4.3353 2.2205 2.3341 4.1063 0.7747 3.2704 8.0391 6.8591 41.5519 40.0107 26.2182 38.6279 33.1814 23.7086 20.7013 13.5742 7.4008 7.5675 4.3540 8.7353 20.2802 3.4657 8.5674 5.5763 1.9482 13.1318 104.4083 91.7897 384.3596 2.1139 27.2694 17.9097 32.8296 30.6190 1.6224 8.6442 36.1641 51.7512 5.9730 11.9014 9.0798 36.9312 38.1733 13.1952 12.1145 49.5650 30.3804 58.7511 77.7691 22.4440 8.2657 10.3468 54.8642 25.9409 11.5625 8.4488 5.3147 5.0513 7.4028 10.8903
temp: 298.150 k
press: 1.00000 atm
elementType: 8 8 8 8 7 7 7 6 6 6 6 6 6 6 6 6 6 6 6 6 6 6 6 6 6 6 6 6 1 1 1 1 1 1 1 1 1 1 1 1 1 1 1 1 1 1 1 1 1 1 1 1 1 1 1 1 1 1 1
symmnumber: 1
zpe: 1294536.5 jmol-1
zpe.correction: 0.493063 hartree
zpe.thermalcorrener: 0.520297 hartree
zpe.thermalcorrenthalpy: 0.521241 hartree
zpe.thermalcorrgfe: 0.437912 hartree
zpe.sumelectzpe: -1281.748853 hartree
zpe.sumelectthermal: -1281.721619 hartree
zpe.sumelectthermalent: -1281.720675 hartree
zpe.sumelectthermalfe: -1281.804005 hartree
dipole: 1.7716 6.9489 -3.0248
dipole: 7.7831
quadrupole: -187.0565 -173.9953 -172.9122
quadrupole: 15.6770 -2.6890 -4.0210
quadrupole: -9.0685 3.9927 5.0758 15.6770 -2.6890 -4.0210
hfenergy: -1282.2419161 hartree
pointgroup: C01 [X(C21H31N3O4)]
dipole: 0.6342835 -2.7402592 1.2104018 debye
polarizability: 297.6449536|0.4739432|241.348097|-6.6808187|-11.2466145|211.0214744 unknown
InChI: InChI=1S/C21H31N3O4/c1-11(25)21(23-24-22)17(28)9-15-14-5-4-12-8-13(26)6-7-19(12,2)18(14)16(27)10-20(15,21)3/h12-15,17-18,26,28H,4-10H2,1-3H3
charge 0 multiplicity 1
59 atoms
O  4.209246 -2.404156 -0.673791
O  -0.863013 2.343831 1.192117
O  -7.087997 0.361878 -0.742802
O  4.139718 1.850839 0.687809
N  3.170903 -0.089777 -1.547328
N  3.548879 0.999253 -2.072887
N  3.867556 1.911003 -2.763915
C  0.898086 -1.103151 -0.100081
C  -0.575552 -1.140779 0.346948
C  1.704312 0.083661 0.517995
C  -1.266708 0.226607 -0.033242
C  -2.795906 0.270053 0.323088
C  -3.467478 -0.953611 -0.407109
C  3.151048 -0.249234 -0.040892
C  1.790166 -2.347434 0.151491
C  -1.330689 -2.325686 -0.303277
C  1.061699 1.412186 0.04272
C  3.248334 -1.788335 0.242517
C  -2.842782 -2.304555 0.004185
C  -0.414794 1.415188 0.466851
C  -3.436909 1.569124 -0.266496
C  -5.010171 -0.949609 -0.274955
C  1.725814 0.067456 2.073767
C  -3.008895 0.222638 1.862005
C  -4.982922 1.590371 -0.172777
C  -5.613122 0.352421 -0.838469
C  4.307186 0.609459 0.551376
C  5.623685 -0.065466 0.880548
H  0.89773 -0.92843 -1.19701
H  -0.62049 -1.267625 1.448112
H  -1.193111 0.282673 -1.147188
H  -3.243356 -0.8172 -1.492159
H  1.507843 -2.86503 1.087884
H  1.708374 -3.073034 -0.677387
H  -0.882946 -3.279167 0.039711
H  -1.183579 -2.280592 -1.403629
H  1.113995 1.476879 -1.062035
H  1.561978 2.293234 0.47427
H  3.618114 -1.910688 1.282282
H  -3.346954 -3.125778 -0.542721
H  -3.015972 -2.493835 1.082408
H  -3.1474 1.650226 -1.336764
H  -3.02269 2.453016 0.246878
H  -5.436628 -1.812196 -0.822479
H  -5.30901 -1.067669 0.787659
H  2.376819 0.873122 2.454756
H  0.718252 0.254147 2.483942
H  2.076776 -0.893272 2.490455
H  -2.598421 1.135418 2.324689
H  -4.07973 0.162514 2.122559
H  -2.515669 -0.649101 2.327585
H  -5.296987 1.630576 0.891309
H  -5.377753 2.504491 -0.654189
H  -5.436424 0.39191 -1.929995
H  4.191745 -3.385009 -0.538963
H  5.553436 -0.558906 1.870805
H  5.858458 -0.851424 0.142432
H  6.42333 0.689941 0.930907
H  -7.335227 0.391034 0.217382
