program: Gaussian 09
title: 000107624
version: EM64L-G09RevD.01
frameworkgroup: C1[X(C10H12O2)]
method: RPBEPBE
basis: SDD
operation: Freq
keyword: #pfreq=noraman
keyword: PBEPBE/SDD
title: #p freq=noraman PBEPBE/SDD
converged: YES YES NO YES
title: Mulliken charges:
elementType: O O C C C C C C C C C C H H H H H H H H H H H H
charge: -0.203708 -0.203678 0.343885 0.343860 -0.318216 -0.318205 -0.189310 -0.189320 -0.778259 -0.778255 -0.202772 -0.202747 0.222368 0.222358 0.230144 0.230146 0.254551 0.216485 0.254566 0.216486 0.254562 0.254553 0.170268 0.170238
chargesum: 0.00000
title: Mulliken charges with hydrogens summed into heavy atoms:
elementType: O O C C C C C C C C C C
charge: -0.203708 -0.203678 0.343885 0.343860 -0.095848 -0.095847 0.040834 0.040826 -0.052657 -0.052654 -0.032504 -0.032509
polarizability: 3.88553286e+02 -6.38510152e+00 1.01295554e+02 -1.75312719e-03 -3.33850441e-03 5.55933665e+01
1716.lowfreq: -81.4238 -80.9037 -13.7442 -8.4000 -2.0869 -0.0003 -0.0001 0.0007 41.6236
frequency: -81.2763 -80.9036 41.6235 54.0949 54.9647 103.3472 163.8355 181.2346 217.7385 223.9971 259.8903 302.8106 309.1515 338.1038 400.0237 461.4924 493.7601 496.3251 502.3378 670.6502 671.7310 829.9467 848.0708 864.3994 895.9046 918.7420 949.3659 969.8265 997.9646 999.3426 1010.6722 1038.2965 1039.2999 1151.9354 1189.0469 1203.8231 1226.0250 1280.6099 1305.5911 1358.8385 1360.3664 1382.4918 1397.5228 1406.1953 1408.1998 1449.7250 1449.9888 1456.0709 1461.2051 1557.3945 1580.7501 1584.7339 1614.5709 1632.5435 2865.8287 2866.5549 2993.1407 2993.1504 3066.2015 3066.2359 3072.4722 3073.7123 3107.9713 3112.2019 3115.8028 3122.2862
redmass: 1.0156 1.0122 9.1625 2.8220 5.9062 6.1129 5.2554 3.9350 4.1505 2.1892 4.1430 2.1944 5.1703 3.5385 2.5438 2.4262 2.1865 3.5376 6.3045 3.2441 3.8272 3.8489 3.7512 1.2912 1.5216 1.9230 1.3790 1.5297 1.7189 1.2178 1.6785 1.5790 1.5404 3.4912 1.8159 2.2659 1.5402 1.6155 1.5540 1.5518 1.7860 1.2795 1.1931 1.3920 1.5703 1.0446 1.0446 1.1354 1.1211 6.6129 6.8107 4.4078 5.6374 5.6763 1.0854 1.0856 1.0380 1.0379 1.0959 1.0959 1.0884 1.0890 1.0945 1.0975 1.0971 1.0884
irintensity: 0.0011 2.1386 6.2664 0.1920 5.5509 0.0000 0.0000 15.3319 0.0000 0.0000 20.8649 0.0000 0.0000 4.2118 13.0085 0.0000 8.7465 0.0000 4.6114 19.1215 0.0002 40.4682 0.0000 0.0000 3.5354 0.0000 3.1150 0.0000 245.8580 99.3507 0.0000 0.0000 0.9689 0.0000 107.6474 91.8430 0.0000 126.2168 0.0000 22.5932 0.0002 0.0000 36.1934 0.0010 241.7057 0.0015 27.7647 0.0000 3.4944 0.0036 967.1772 0.1943 0.0018 34.1312 215.1152 0.1440 17.5034 0.0123 0.0043 18.3504 20.6720 0.0000 0.0000 2.2292 0.0000 46.1188
temp: 298.150 k
press: 1.00000 atm
elementType: 8 8 6 6 6 6 6 6 6 6 6 6 1 1 1 1 1 1 1 1 1 1 1 1
symmnumber: 1
zpe: 497778.9 jmol-1
zpe.correction: 0.189594 hartree
zpe.thermalcorrener: 0.201832 hartree
zpe.thermalcorrenthalpy: 0.202776 hartree
zpe.thermalcorrgfe: 0.149799 hartree
zpe.sumelectzpe: -537.769739 hartree
zpe.sumelectthermal: -537.757501 hartree
zpe.sumelectthermalent: -537.756557 hartree
zpe.sumelectthermalfe: -537.809534 hartree
dipole: -0.0001 0.0002 0.0008
dipole: 0.0008
quadrupole: -128.0160 -62.0821 -73.5190
quadrupole: -5.8962 -0.0058 -0.0006
quadrupole: -40.1436 25.7903 14.3534 -5.8962 -0.0058 -0.0006
hfenergy: -537.9593332 hartree
pointgroup: C01 [X(C10H12O2)]
dipole: 0.0000238 -0.0000653 0.000308 debye
dipolederiv: -1.7266316 -0.0543046 -0.0001002 0.1241191 -0.4249694 0.000013 0.0002069 -0.0000041 -0.3296265 -1.72676 -0.0543229 -0.0001883 0.1241207 -0.4249684 0.0000683 0.0008361 0.0000045 -0.3296175 -1.0053015 -0.1853824 -0.0000354 -1.2317223 0.2044589 0.0000261 -0.0001613 0.0000898 -0.0185529 -1.0053287 -0.1854111 0.0000194 -1.231819 0.2044253 0.0000692 0.0001242 0.0000928 -0.018554 0.4635958 0.0789086 0.0000586 0.1926197 0.003378 0.0000238 -0.0000638 -0.0000214 -0.1502994 0.4636122 0.0788992 0.0000831 0.1926419 0.0033845 0.0000477 -0.0004111 -0.0000344 -0.1503014 -0.1120444 -0.0336764 0.0000044 -0.0355115 0.0967091 0.0000233 0.0001336 0.0000269 -0.126302 -0.1120475 -0.0336755 -0.00001 -0.0355281 0.096711 -0.0000124 -0.0000234 0.0000363 -0.1263013 -0.1934946 0.1162385 -0.0000241 0.1846454 -0.1899762 -0.0000562 0.0002118 -0.000149 0.0415675 -0.1934849 0.116244 -0.0000071 0.184635 -0.1899648 -0.000051 0.0000993 -0.0001631 0.0415682 2.2479509 0.0325319 0.0000879 0.8709089 0.6214898 -0.0000034 -0.0001117 -0.0000667 0.0768704 2.2480669 0.0325253 0.0001137 0.8709761 0.6215231 -0.0002338 -0.0007387 -0.0003327 0.0768823 0.0348437 0.0238402 -0.0000083 -0.0372743 -0.1125251 -0.0000172 -0.0000048 -0.0000095 0.1579565 0.0348471 0.0238319 -0.0000046 -0.0372731 -0.1125318 -0.000016 -0.0000305 -0.000006 0.1579536 0.0577962 -0.0159267 -0.000008 -0.0543146 -0.0918968 -0.0000212 0.0000079 -0.0000172 0.1593347 0.0577969 -0.0159257 -0.0000047 -0.0543144 -0.0918944 -0.0000208 -0.0000068 -0.0000242 0.159335 0.0863589 0.0241005 0.0951558 0.0523437 0.0678704 -0.0112034 0.0965248 -0.053548 -0.0127261 -0.010316 -0.1463212 0.0001182 -0.0539367 0.0094996 0.000048 -0.0000326 0.0000727 0.1067038 0.0861921 0.0241682 -0.0952462 0.0522488 0.067956 0.0111573 -0.0966407 0.0535323 -0.0125144 -0.010316 -0.1463249 0.0000904 -0.0539347 0.0094906 0.0000475 -0.0000784 0.0000602 0.1067042 0.0863119 0.024106 0.0951609 0.0522678 0.0678797 -0.0111936 0.0965507 -0.0535393 -0.0126991 0.0862279 0.0241647 -0.0952445 0.0523238 0.067946 0.0111637 -0.0966217 0.0535372 -0.0125457 0.0710535 0.1358216 0.000005 -0.0641247 -0.2519942 0.0000183 0.000035 0.0000954 0.1075896 0.0710711 0.1358907 -0.0000163 -0.0640974 -0.2520011 0.0001228 0.0001953 0.0003673 0.1075746 unknown
polarizability: 388.2926558|-10.7503374|101.5561849|0.0018037|0.0033115|55.5933665 unknown
InChI: InChI=1S/C10H12O2/c1-9(7-11)5-3-4-6-10(2)8-12/h3-8H,1-2H3
charge 0 multiplicity 1
24 atoms
O  -5.49551 -0.422567 -0.00004
O  5.495523 0.422592 -0.000592
C  -3.14183 0.170602 -0.00017
C  3.14192 -0.170622 0.000245
C  -1.872265 -0.387644 -0.000125
C  1.872353 0.387613 0.000197
C  -0.614782 0.319511 0.000019
C  0.614877 -0.319549 0.000067
C  -3.474209 1.642579 -0.000096
C  3.474328 -1.642598 0.000157
C  -4.281678 -0.774828 -0.000312
C  4.281715 0.774821 0.000435
H  -1.808675 -1.488003 -0.000195
H  1.808756 1.487971 0.000276
H  -0.632538 1.417711 0.000097
H  0.632637 -1.41775 -0.000019
H  -4.093246 1.891465 0.881378
H  -2.582999 2.288484 -0.000625
H  -4.094225 1.891316 -0.880916
H  2.583135 -2.288527 0.000581
H  4.093452 -1.891444 -0.881266
H  4.094263 -1.891357 0.881029
H  -3.999945 -1.859356 -0.000068
H  3.999742 1.85928 -0.000557
