program: Gaussian 09
title: 000107620
version: EM64L-G09RevD.01
frameworkgroup: C1[X(C15H22O10)]
method: RPBEPBE
basis: SDD
operation: Freq
keyword: #p
keyword: freq=noraman
keyword: PBEPBE/SDD
title: #p freq=noraman PBEPBE/SDD
converged: YES YES NO NO
title: Mulliken charges:
elementType: O O O O O O O O O O C C C C C C C C C C C C C C C H H H H H H H H H H H H H H H H H H H H H H
charge: -0.225453 -0.253583 -0.282929 -0.262576 -0.276616 -0.254909 -0.234743 -0.255088 -0.244844 -0.270078 -0.117533 -0.087212 -0.062650 -0.054918 -0.118814 -0.376876 0.286428 0.334295 0.303303 -0.501970 -0.759651 -0.773707 0.325667 -0.762077 -0.762700 0.303427 0.331027 0.308572 0.243317 0.270630 0.238323 0.260402 0.240072 0.221421 0.228112 0.254189 0.246335 0.250635 0.246348 0.241557 0.279902 0.255359 0.245628 0.254202 0.245234 0.239683 0.284859
chargesum: 0.00000
title: Mulliken charges with hydrogens summed into heavy atoms:
elementType: O O O O O O O O O O C C C C C C C C C C C C C C C
charge: -0.225453 -0.253583 -0.282929 -0.262576 -0.276616 -0.254909 -0.234743 -0.255088 -0.244844 -0.270078 0.185894 0.243815 0.245922 0.188399 0.151816 0.121849 0.286428 0.334295 0.303303 0.187636 -0.008492 -0.005900 0.325667 -0.006888 0.007075
polarizability: 2.07658100e+02 1.43243171e+01 1.81862177e+02 7.97296764e+00 4.56464802e+00 1.87468196e+02
1716.lowfreq: -15.2544 0.0005 0.0006 0.0008 0.2868 2.8393 6.1486 19.7389 25.5939
frequency: -14.8284 19.7221 25.5631 34.7387 41.9909 49.8912 53.9132 59.8823 65.9710 69.3734 71.4757 77.6871 87.0458 94.0773 99.0704 114.7872 125.3850 129.9292 147.1762 166.3902 179.2945 192.7892 200.7796 216.7117 229.0533 252.2638 266.3434 291.6338 301.9235 314.9811 365.9978 375.5686 414.9577 441.2811 462.2560 465.0407 491.6049 544.0321 556.9037 558.7407 562.6514 568.2613 587.2919 605.8208 618.4629 631.4196 637.6184 653.9802 758.9220 787.0137 791.4757 825.3807 848.3211 867.7483 892.9796 902.9803 923.2389 934.3037 968.1448 977.6597 996.0939 997.1377 1001.2224 1008.3095 1022.4582 1031.3975 1042.3974 1043.4274 1046.6060 1046.9384 1048.5151 1066.2986 1084.2512 1114.1907 1140.0125 1146.8356 1162.1959 1178.6763 1192.6667 1195.9438 1213.3704 1235.6083 1252.3565 1269.0392 1284.7673 1299.6928 1307.2433 1324.0535 1333.3061 1341.6532 1351.8776 1365.8211 1376.8198 1381.7838 1382.7412 1384.5730 1385.8028 1429.3558 1450.3808 1451.9642 1452.3877 1452.9971 1453.4222 1454.1486 1455.2775 1457.3421 1458.2816 1458.8783 1474.8257 1647.5548 1651.6875 1656.3914 1658.8652 2964.9396 2980.1434 3003.2751 3004.0128 3008.1446 3009.0278 3033.0523 3037.9569 3044.2280 3057.0510 3077.8357 3085.8299 3098.0193 3098.9475 3100.4235 3101.5765 3103.4948 3125.2010 3140.8569 3141.7323 3143.9308 3144.8679
redmass: 1.1278 6.2405 5.5700 5.1072 5.8800 4.7324 1.6342 2.4420 3.1639 3.3029 4.9522 3.0068 3.3490 8.9715 3.7110 1.0314 1.3387 1.0512 5.2212 3.1272 6.8037 5.6907 6.1536 7.2142 6.8460 5.1816 5.1332 3.9012 2.6945 4.1603 4.1994 4.5250 3.4490 4.3153 4.4356 4.0080 4.2315 4.1267 3.5051 3.2486 3.3826 3.6115 5.2094 4.3378 5.6238 4.5541 4.8574 4.7004 5.6840 4.7952 3.5112 5.3662 5.6309 4.7415 5.3074 5.5445 5.4367 5.0371 3.2982 3.5556 1.9266 2.1093 2.5659 2.1638 4.4843 3.8919 1.7015 1.6750 1.6679 1.6578 3.1823 2.5913 3.3385 1.2832 1.7056 2.3876 1.9187 3.0701 3.1792 2.8945 3.6820 1.6524 1.1845 1.4361 1.2057 1.2869 1.2397 1.2333 1.4042 1.3826 1.4281 1.4390 1.3952 1.3005 1.2394 1.2478 1.2629 1.1434 1.0731 1.0539 1.0580 1.0515 1.0552 1.0642 1.0561 1.0559 1.0522 1.0587 1.0515 9.3829 9.3598 9.6509 10.1639 1.0322 1.0825 1.0386 1.0384 1.0377 1.0371 1.0576 1.0869 1.0845 1.1034 1.0861 1.0846 1.0965 1.0954 1.0934 1.0935 1.1072 1.1011 1.1028 1.1028 1.1019 1.1014
irintensity: 1.0714 0.5405 0.2601 0.3411 2.1239 0.4803 1.5107 0.4040 3.5322 5.8417 3.7302 2.6805 1.4489 0.8332 6.4139 0.5352 2.8403 0.4153 1.2059 9.8448 2.6555 3.0840 9.1075 7.2524 2.3994 4.2243 2.8776 4.5614 15.6170 2.3611 4.7236 12.3319 1.8129 41.5327 15.0981 8.6614 3.1967 1.7643 8.5194 6.5743 6.2469 2.5683 3.5754 5.2429 4.9840 9.7905 1.4951 4.9276 19.5233 6.7732 24.8080 14.8155 29.8644 62.3325 28.6581 26.8601 77.7327 153.5416 12.1653 29.4906 76.1349 92.8405 92.5093 122.1090 127.0407 54.9481 13.4887 14.8602 13.5640 14.1840 40.8841 57.9501 80.1476 2.0222 24.5784 13.5546 68.9174 29.2071 341.4395 524.7482 267.6441 54.5095 9.2647 9.3546 10.1771 5.4290 2.3667 6.3376 7.0164 3.2896 3.3374 3.6277 12.3579 49.1145 71.6988 44.8914 78.6202 4.7007 46.4904 28.0072 12.7024 24.5072 21.4106 11.3669 6.0063 21.7674 12.2952 5.7190 11.1728 181.1130 74.5433 217.1047 211.3268 62.2895 16.0666 2.0948 1.2610 1.6213 1.0925 25.6343 23.5386 5.9847 38.4915 2.0081 6.0083 5.4277 6.1710 8.7210 5.7285 5.9667 18.5213 6.6327 8.9034 8.9982 9.7646
temp: 298.150 k
press: 1.00000 atm
elementType: 8 8 8 8 8 8 8 8 8 8 6 6 6 6 6 6 6 6 6 6 6 6 6 6 6 1 1 1 1 1 1 1 1 1 1 1 1 1 1 1 1 1 1 1 1 1 1
symmnumber: 1
zpe: 954765.3 jmol-1
zpe.correction: 0.363651 hartree
zpe.thermalcorrener: 0.391537 hartree
zpe.thermalcorrenthalpy: 0.392481 hartree
zpe.thermalcorrgfe: 0.301693 hartree
zpe.sumelectzpe: -1335.089399 hartree
zpe.sumelectthermal: -1335.061513 hartree
zpe.sumelectthermalent: -1335.060569 hartree
zpe.sumelectthermalfe: -1335.151357 hartree
dipole: 0.8700 -0.6522 0.5286
dipole: 1.2090
quadrupole: -164.6071 -131.7274 -133.5918
quadrupole: 3.1166 -3.7139 7.7249
quadrupole: -21.2983 11.5814 9.7170 3.1166 -3.7139 7.7249
hfenergy: -1335.4530496 hartree
pointgroup: C01 [X(C15H22O10)]
dipole: -0.421163 0.1264409 0.1813198 debye
polarizability: 192.8361601|18.1208129|194.2577732|-8.4880804|-8.264895|189.8945396 unknown
InChI: InChI=1S/C15H22O10/c1-7(16)21-6-11-12(22-8(2)17)13(23-9(3)18)14(24-10(4)19)15(20-5)25-11/h11-15H,6H2,1-5H3
charge 0 multiplicity 1
47 atoms
O  -0.522841 2.015898 -0.890563
O  1.730803 -1.361675 0.382515
O  -0.891373 -1.715259 -0.780821
O  1.397393 1.314772 1.212365
O  1.325314 1.843397 -2.442913
O  -2.985678 0.717782 0.351054
O  3.542532 -1.594703 -1.074252
O  -1.50911 -2.295028 1.403564
O  3.030297 2.980468 1.206914
O  -4.322323 -1.163545 -0.036942
C  1.133405 -0.356579 -0.526763
C  -0.384511 -0.400473 -0.319576
C  1.673297 1.050298 -0.222949
C  -1.058861 0.669695 -1.213794
C  0.926724 2.101982 -1.07532
C  -2.577604 0.730181 -1.076582
C  2.958126 -1.920917 -0.018584
C  -1.455073 -2.574623 0.18747
C  2.165916 2.318732 1.823374
C  0.968775 2.929714 -3.371311
C  3.433548 -2.919099 1.011428
C  -2.014702 -3.808188 -0.475665
C  -3.854783 -0.313367 0.755442
C  1.774437 2.460839 3.274792
C  -4.082279 -0.257609 2.244593
H  1.403614 -0.602403 -1.570435
H  -0.636231 -0.251429 0.743664
H  2.756282 1.12638 -0.415584
H  -0.822919 0.443545 -2.275275
H  1.181512 3.129773 -0.758017
H  -2.942925 1.679966 -1.500862
H  -3.047401 -0.128386 -1.586338
H  1.319049 2.602322 -4.36141
H  1.48179 3.868365 -3.083617
H  -0.124488 3.096268 -3.387988
H  2.599961 -3.555527 1.349646
H  4.241588 -3.533052 0.588069
H  3.817679 -2.380914 1.896837
H  -1.47085 -4.049335 -1.401321
H  -1.98717 -4.656068 0.225584
H  -3.071458 -3.604422 -0.731208
H  0.748833 2.865047 3.344841
H  2.471634 3.14224 3.782845
H  1.771637 1.47598 3.770775
H  -3.975344 0.768497 2.62699
H  -5.074958 -0.665488 2.488887
H  -3.315363 -0.894452 2.723741
