program: Gaussian 09
title: 000109900
version: EM64L-G09RevD.01
frameworkgroup: C1[X(C8H8ClNO3)]
method: RPBEPBE
basis: SDD
operation: Freq
keyword: #p
keyword: freq=noraman
keyword: PBEPBE/SDD
title: #p freq=noraman PBEPBE/SDD
converged: YES YES NO NO
title: Mulliken charges:
elementType: Cl O O O N C C C C C C C C H H H H H H H H
charge: 0.030378 -0.237546 -0.156647 -0.150668 -0.088219 -0.389056 -0.376728 0.412218 -0.298744 -0.294920 -0.401332 -0.068057 0.132092 0.239291 0.278625 0.240331 0.243761 0.207142 0.237135 0.235907 0.205038
chargesum: 0.00000
title: Mulliken charges with hydrogens summed into heavy atoms:
elementType: Cl O O O N C C C C C C C C
charge: 0.030378 -0.237546 -0.156647 -0.150668 -0.088219 0.128859 0.107364 0.412218 0.145534 0.146024 -0.401332 -0.068057 0.132092
polarizability: 1.56439681e+02 1.50747133e+00 1.30674876e+02 8.79004390e+00 -8.90317276e-01 6.26470646e+01
1716.lowfreq: -13.5413 0.0011 0.0016 0.0022 4.9036 7.2907 44.9932 52.9686 90.5539
frequency: 44.9055 52.8353 90.5457 113.3092 170.8972 183.5771 221.7854 253.9053 285.2739 329.3237 352.9317 406.9704 453.9206 460.4915 480.7476 526.8549 551.8239 626.9870 742.1024 771.1521 789.6629 819.3085 830.7399 847.9846 905.7341 954.7873 1004.9156 1017.0087 1050.7494 1070.7770 1081.0675 1115.1372 1149.7522 1193.8846 1230.0311 1265.2869 1276.5737 1331.8582 1340.4365 1346.6802 1363.6087 1382.4129 1448.2255 1453.2077 1456.1693 1463.6357 1638.1065 1678.1025 1769.6416 2959.5147 2964.7846 2996.1763 2998.8050 3083.5734 3092.0280 3095.2891 3098.2853
redmass: 6.1919 4.1984 9.9878 6.6418 8.8387 8.5449 2.7656 6.5464 4.3082 3.3818 5.0214 2.2202 3.2879 10.5155 7.7966 4.1497 9.1351 2.2170 10.5194 12.1338 4.6520 5.0038 1.6841 7.5201 3.1542 4.6015 2.8356 2.6822 2.1971 3.7306 4.0118 2.6885 4.3952 1.0643 1.8242 1.3122 1.2567 1.4332 1.2603 1.4144 1.4183 1.4865 1.0787 1.0841 1.0936 1.0910 9.6647 12.7521 12.2171 1.0682 1.0682 1.0627 1.0640 1.1019 1.0954 1.1011 1.0985
irintensity: 3.1608 0.0804 1.3264 1.2142 4.0813 0.7608 2.6560 6.4384 15.3146 1.9732 3.7637 0.8954 1.7527 6.1414 8.0606 18.3073 0.4238 8.8097 7.7672 1.5718 10.1653 13.5761 1.8950 9.3206 35.8238 74.0057 6.7289 9.2220 32.8845 27.3520 26.9924 26.7116 12.9944 0.8445 169.2219 18.4474 14.1532 30.6159 4.1269 21.4397 4.7465 11.1352 9.0156 10.2967 17.6387 34.1078 870.4265 278.9535 79.7547 34.3739 53.3133 16.5325 60.4186 5.6332 24.6802 5.3880 27.3836
temp: 298.150 k
press: 1.00000 atm
elementType: 17 8 8 8 7 6 6 6 6 6 6 6 6 1 1 1 1 1 1 1 1
symmnumber: 1
zpe: 398860.6 jmol-1
zpe.correction: 0.151918 hartree
zpe.thermalcorrener: 0.163771 hartree
zpe.thermalcorrenthalpy: 0.164716 hartree
zpe.thermalcorrgfe: 0.112625 hartree
zpe.sumelectzpe: -1049.101705 hartree
zpe.sumelectthermal: -1049.089852 hartree
zpe.sumelectthermalent: -1049.088907 hartree
zpe.sumelectthermalfe: -1049.140998 hartree
dipole: 5.8546 -2.9298 0.7816
dipole: 6.5932
quadrupole: -105.8683 -85.0943 -79.1134
quadrupole: 7.8962 -1.4897 0.4922
quadrupole: -15.8430 4.9310 10.9120 7.8962 -1.4897 0.4922
hfenergy: -1049.2536231 hartree
pointgroup: C01 [X(C8H8Cl1N1O3)]
dipole: 2.4092943 0.956931 0.0910292 debye
dipolederiv: -0.0844329 -0.0171942 0.0115157 0.0916981 -0.6511201 -0.3861125 0.0788019 -0.3761402 -0.1797812 -0.5378721 0.0535553 -0.073134 0.0535398 -0.6708342 -0.1298627 -0.087036 -0.1242608 -0.5203774 -0.3733272 0.116649 0.0817434 -0.0779743 -1.0210547 -0.4259797 -0.0177013 -0.4461337 -0.4988076 -1.5793162 -0.2656938 0.1025752 -0.1799003 -0.290747 0.0258891 0.1918109 0.0528466 -0.2873896 -1.52377 0.0351028 0.1805738 -0.0948049 -0.2373473 0.0482701 0.0099648 0.013864 -0.2891914 0.1766213 -0.1839889 -0.1888732 -0.3103005 0.126861 0.0294328 -0.334332 0.0195501 0.2715017 0.1234052 0.2094991 0.041193 0.422203 0.2305664 -0.0692865 0.0743743 -0.0455889 0.1537043 1.9308191 -0.1577532 -0.3901219 -0.1959314 -0.5278378 -0.3393364 -0.4737886 -0.3252132 0.0407936 0.3856989 0.1666254 0.0864295 0.1046282 0.5177667 0.0352408 0.20773 0.0278514 0.3334042 0.4033 -0.1723281 -0.1061253 -0.2432861 0.4119777 0.0944089 0.0167601 0.0826517 0.4384011 -1.1173421 -0.2743806 0.0075808 -0.3461609 0.7654717 0.5729238 0.0285117 0.5752324 0.1401323 0.1268847 0.0606914 0.0318613 0.2242198 1.173682 0.5627886 0.1193042 0.5680805 0.4073992 2.015838 0.5610986 -0.0639613 0.6622385 0.1693709 -0.1157429 -0.052585 -0.1192285 0.1058143 -0.0228676 0.0274501 0.0839603 0.0432941 0.0220482 0.1166245 0.1247396 0.0452972 -0.0726817 0.1003725 -0.084593 -0.0497423 0.017196 0.0384487 -0.0317393 0.0077209 -0.0210674 0.0976084 0.0500426 0.087011 0.0546615 0.0028939 0.0356134 -0.0457 0.0101441 -0.0540448 0.0609097 -0.0172419 -0.0751673 0.0227955 -0.1299834 0.0228348 0.0458362 0.0258383 0.1128645 -0.0708782 0.0249871 -0.1173607 0.0292864 -0.0511982 -0.0331515 0.0383724 0.0055686 0.1257342 -0.1125439 -0.0513144 0.0806503 0.0576316 0.0546387 -0.0039869 -0.0691543 0.0462805 -0.0987881 0.0327599 -0.0496868 -0.082359 -0.0360384 -0.067672 -0.0576178 -0.0753253 -0.03014 -0.0453217 0.0762058 0.0192017 0.0324859 0.1161884 0.020662 -0.0209444 0.1184525 0.0480329 0.0318148 -0.1269833 unknown
polarizability: 155.0661193|1.9565353|114.9300318|-12.53479|29.1184648|79.7654712 unknown
InChI: InChI=1S/C8H8ClNO3/c9-5-6(8(12)7(5)11)10-1-3-13-4-2-10/h1-4H2
charge 0 multiplicity 1
21 atoms
Cl -1.726108 2.288734 1.36918
O  3.593746 -0.019625 0.179147
O  -1.347171 -2.141319 -1.144932
O  -3.866445 -0.430159 0.354093
N  0.779601 0.234626 -0.333842
C  1.590877 -0.766107 -1.084447
C  1.558769 1.402491 0.156213
C  -0.53538 0.060632 -0.125587
C  2.799364 -1.19203 -0.227789
C  2.769604 0.902812 0.973736
C  -1.61089 0.746526 0.493657
C  -1.490427 -1.06712 -0.528838
C  -2.646808 -0.271677 0.167297
H  1.951291 -0.292557 -2.018202
H  0.958897 -1.632065 -1.343098
H  0.914062 2.054021 0.76782
H  1.918841 1.976569 -0.719509
H  2.454989 -1.747063 0.67081
H  3.48466 -1.826985 -0.811244
H  3.431923 1.742771 1.237699
H  2.420604 0.400826 1.901635
