program: Gaussian 09
title: 000109893
version: EM64L-G09RevD.01
frameworkgroup: C1[X(C16H15NO2S)]
method: RPBEPBE
basis: SDD
operation: Freq
keyword: #p
keyword: freq=noraman
keyword: PBEPBE/SDD
title: #p freq=noraman PBEPBE/SDD
converged: YES YES NO NO
title: Mulliken charges:
elementType: S O O N C C C C C C C C C C C C C C C C H H H H H H H H H H H H H H H
charge: 0.240820 -0.198830 -0.243406 -0.235490 0.638158 -0.399559 -0.389681 -0.016521 -0.529014 0.488555 -0.284309 -0.427600 -0.661078 -0.330455 -0.814847 0.133325 0.210063 -0.372836 -0.266313 -0.164728 0.242091 0.226173 0.238293 0.244246 0.237809 0.230225 0.248905 0.224688 0.243433 0.239538 0.227815 0.224917 0.278199 0.254763 0.262653
chargesum: 0.00000
title: Mulliken charges with hydrogens summed into heavy atoms:
elementType: S O O N C C C C C C C C C C C C C C C C
charge: 0.240820 -0.198830 -0.243406 -0.235490 0.638158 -0.399559 0.078583 -0.016521 -0.290722 0.488555 -0.040062 -0.189791 0.042739 -0.087022 -0.122577 0.133325 0.210063 -0.094637 -0.011551 0.097925
polarizability: 3.52505285e+02 1.26361252e+01 2.15627194e+02 -8.53586551e+00 -9.88677696e+00 1.15480947e+02
1716.lowfreq: -4.3507 -0.0012 0.0011 0.0015 2.0745 9.6669 25.6026 36.4173 39.8036
frequency: 25.0939 36.4044 39.7852 43.4991 58.7243 77.9784 97.2918 125.6350 133.3618 154.5684 200.3745 209.7416 215.6009 241.1020 281.3621 302.8960 321.8340 361.5152 387.4997 397.0327 436.6119 462.9871 481.0537 528.7167 546.8272 577.7103 591.0884 601.4461 608.8021 620.4654 630.4374 703.4207 720.6109 725.4476 741.4228 744.3879 800.8898 809.0838 810.7897 828.4833 858.2090 871.0384 881.7101 883.5321 888.4131 942.3828 953.9269 1004.1477 1007.2897 1030.0445 1047.0536 1048.3089 1053.0875 1087.5922 1105.6364 1135.1490 1141.8469 1149.2727 1198.0014 1206.0573 1219.8711 1272.5069 1279.2664 1293.0706 1317.7794 1344.1872 1348.3393 1359.6258 1387.6469 1390.7845 1399.6328 1443.4230 1459.7059 1468.1958 1472.6386 1474.8090 1475.8256 1483.7383 1498.3734 1509.9575 1553.2890 1575.1797 1595.0621 1610.1242 2977.4864 2993.3282 3024.4231 3058.5692 3070.9415 3087.7962 3092.9328 3102.8015 3137.1841 3137.8523 3143.4902 3161.8988 3220.3211 3236.9199 3265.8652
redmass: 5.2052 1.0190 5.5033 5.7385 3.1029 3.8792 4.9766 5.7387 5.4083 6.1532 3.4485 1.9789 1.8813 3.6834 3.2550 4.8698 7.6149 3.9668 3.8076 4.9740 3.1148 7.7624 4.9645 4.3745 4.1950 5.7512 3.0366 4.1762 5.5761 5.0315 5.7864 4.2515 4.7405 3.8018 2.5764 1.2548 1.4690 1.3008 1.7050 1.3818 1.4418 6.4652 3.2501 2.0064 2.2760 1.3433 2.2535 1.5804 1.5623 5.0809 1.7421 2.5621 2.8338 1.9744 3.0098 1.6771 2.0101 1.5800 1.9655 1.5276 2.2832 2.1515 1.3140 2.4158 2.3257 1.3335 2.4161 2.5711 5.3654 1.2463 1.2350 3.8936 5.4139 1.0679 2.0788 1.1047 1.2996 1.0588 2.0565 1.7839 6.3422 6.8795 7.4575 6.8246 1.0387 1.0355 1.0612 1.0954 1.1018 1.0996 1.0997 1.1021 1.0883 1.0861 1.0910 1.0968 1.0913 1.0992 1.1083
irintensity: 2.9164 0.8075 0.9025 0.6169 1.4142 1.3133 0.7948 1.2558 1.4887 6.3019 3.2349 1.2386 1.1105 3.7768 0.1973 0.2155 3.5967 0.9010 1.2907 8.8417 7.2458 1.4091 5.5308 8.5076 10.1320 7.3324 6.8050 5.6685 1.1565 0.9148 0.9926 9.0818 5.1735 0.6118 56.7823 77.3942 22.8724 54.9202 104.2757 6.4009 8.6330 3.9251 8.1889 2.2180 4.7422 0.5250 24.3746 7.7158 26.1410 7.4412 13.4740 9.2447 19.1202 10.7610 48.7277 27.5255 28.0065 25.9322 7.9462 1.0936 120.7772 8.5472 5.8581 179.2611 97.0063 13.2963 28.8441 2.4089 30.8319 20.2381 7.8790 71.9634 116.9871 8.1954 61.8122 15.1078 20.1340 3.0283 41.0548 138.2682 97.9685 856.0120 96.2384 12.3710 44.7596 19.1743 26.2906 20.9556 1.5204 16.7864 33.4183 22.0229 9.2123 3.7839 13.4694 10.2851 5.7349 0.1063 0.4915
temp: 298.150 k
press: 1.00000 atm
elementType: 16 8 8 7 6 6 6 6 6 6 6 6 6 6 6 6 6 6 6 6 1 1 1 1 1 1 1 1 1 1 1 1 1 1 1
symmnumber: 1
zpe: 706511.7 jmol-1
zpe.correction: 0.269096 hartree
zpe.thermalcorrener: 0.287916 hartree
zpe.thermalcorrenthalpy: 0.288860 hartree
zpe.thermalcorrgfe: 0.219762 hartree
zpe.sumelectzpe: -1220.504719 hartree
zpe.sumelectthermal: -1220.485900 hartree
zpe.sumelectthermalent: -1220.484956 hartree
zpe.sumelectthermalfe: -1220.554054 hartree
dipole: -6.8716 -1.7830 2.6783
dipole: 7.5875
quadrupole: -122.3527 -113.1875 -128.5507
quadrupole: -20.8997 8.9100 2.3725
quadrupole: -0.9890 8.1761 -7.1870 -20.8997 8.9100 2.3725
hfenergy: -1220.7738154 hartree
pointgroup: C01 [X(C16H15N1O2S1)]
dipole: 2.6736153 -0.4352635 -1.2543939 debye
polarizability: 351.7904501|-9.9565888|205.2068355|-16.4648424|32.5039335|126.6161405 unknown
InChI: InChI=1S/C16H15NO2S/c1-3-17-12-9-11(2)6-7-15(12)20-16(17)10-13(18)14-5-4-8-19-14/h4-10H,3H2,1-2H3
charge 0 multiplicity 1
35 atoms
S  -0.289559 -1.064807 -0.148131
O  -4.472981 -0.599002 0.45836
O  -3.537111 1.922666 1.377637
N  1.074962 1.184637 0.263302
C  2.067285 0.218928 -0.025426
C  1.529704 -1.072893 -0.257608
C  1.415826 2.593878 0.559147
C  -0.258878 0.735357 0.230079
C  3.462857 0.423041 -0.10258
C  4.319209 -0.670464 -0.391784
C  2.357751 -2.164555 -0.551856
C  3.756646 -1.95442 -0.614929
C  1.334166 3.503724 -0.684214
C  -1.357167 1.530286 0.512447
C  5.824075 -0.468123 -0.44097
C  -2.776417 1.194886 0.648901
C  -3.361132 0.060958 -0.117029
C  -3.175762 -0.416352 -1.413762
C  -4.190688 -1.411367 -1.659976
C  -4.950242 -1.495642 -0.501559
H  0.741188 2.955886 1.354313
H  2.43303 2.608482 0.985859
H  3.89616 1.416858 0.050911
H  1.93689 -3.158545 -0.73211
H  4.416233 -2.79851 -0.844515
H  2.033641 3.165074 -1.468398
H  0.314994 3.503839 -1.106937
H  1.594469 4.542091 -0.411178
H  -1.162804 2.563172 0.823664
H  6.26956 -0.550823 0.569417
H  6.311603 -1.226147 -1.077837
H  6.089442 0.529005 -0.8351
H  -2.413434 -0.076091 -2.111108
H  -4.340582 -1.983012 -2.57356
H  -5.801034 -2.099713 -0.198368
