program: Gaussian 09
title: 000107573
version: EM64L-G09RevD.01
frameworkgroup: C1[X(C14H18N2O5)]
method: RPBEPBE
basis: SDD
operation: Freq
keyword: #p
keyword: freq=noraman
keyword: PBEPBE/SDD
title: #p freq=noraman PBEPBE/SDD
converged: YES YES NO NO
title: Mulliken charges:
elementType: O O O O O N N C C C C C C C C C C C C C C H H H H H H H H H H H H H H H H H H
charge: -0.268868 -0.302692 -0.226966 -0.247881 -0.280335 -0.377902 -0.618216 -0.170450 -0.558953 0.230879 0.267568 0.313370 -0.419777 0.469935 -0.218713 -0.370180 -0.402076 -0.671153 -0.225718 -0.224957 -0.233074 0.317057 0.276065 0.209848 0.318589 0.235707 0.230082 0.224395 0.235661 0.238150 0.235754 0.314671 0.339504 0.213100 0.226121 0.237785 0.227193 0.227316 0.229162
chargesum: 0.00000
title: Mulliken charges with hydrogens summed into heavy atoms:
elementType: O O O O O N N C C C C C C C C C C C C C C
charge: -0.268868 -0.302692 -0.226966 -0.247881 -0.280335 -0.059313 0.035959 0.146607 -0.073040 0.230879 0.267568 0.313370 0.046012 0.469935 0.241343 -0.132030 -0.166322 0.005853 0.001475 0.002358 -0.003912
polarizability: 2.28488544e+02 1.29581043e+01 1.71475483e+02 -1.87660843e+01 9.42808666e+00 1.44245288e+02
1716.lowfreq: -23.9118 -4.0717 -0.0005 0.0001 0.0005 2.3331 3.7479 13.7911 20.5987
frequency: -22.6798 13.6135 20.4566 26.4016 34.2724 41.7527 50.1295 57.0680 61.1153 79.4464 111.3369 126.8246 143.1862 159.7877 219.7699 225.8473 240.0974 255.5213 307.4004 318.2561 328.9453 340.3084 381.4497 402.8068 432.3800 477.0004 487.8627 514.6804 543.0005 555.9061 558.4764 578.3959 616.6225 647.9392 676.5941 693.7223 698.8452 705.9149 737.7258 759.4128 799.9619 817.9892 832.4106 854.5042 859.6074 877.0922 887.6720 926.0398 935.2834 953.0688 977.4746 988.9633 991.1194 996.8923 1020.1501 1026.5740 1039.7430 1078.1993 1088.1277 1111.6802 1135.4931 1137.7700 1151.8123 1172.5767 1174.3252 1187.7769 1191.9379 1218.9603 1227.5535 1249.7720 1263.7064 1287.9258 1325.2297 1334.4161 1355.0785 1359.5348 1368.9619 1385.5042 1402.0737 1439.6115 1444.2420 1463.7064 1474.6135 1477.0734 1486.2334 1486.9692 1491.9388 1596.2811 1598.3777 1617.2639 1642.2254 1651.3503 1666.4210 2992.2702 2996.7450 3011.8755 3012.2932 3035.3093 3065.5243 3071.7233 3076.9389 3093.0940 3109.6589 3121.7355 3125.0730 3136.5181 3148.4786 3164.4042 3517.5145 3564.8508 3673.3173
redmass: 4.1741 3.8596 5.2885 4.9635 5.0378 7.9347 7.2968 3.7881 5.2198 2.7641 5.2975 3.9381 2.9688 5.3041 4.0740 5.2944 3.4207 1.6959 4.5983 2.6636 3.6986 2.8683 3.8446 2.7989 3.3039 3.4998 1.4247 1.7065 1.6131 3.2081 4.0448 2.5035 6.3429 2.3142 3.3733 3.7339 10.6378 1.8818 7.0457 2.0362 1.1030 3.7017 3.6499 1.2469 3.7142 4.8781 2.3856 2.5769 2.3676 1.6375 1.3925 6.2075 5.9316 1.3362 2.3182 2.1861 2.2282 2.5557 1.5168 2.3570 1.5280 3.5856 2.4954 1.0607 1.7599 1.1268 1.1025 1.8787 2.3490 1.1385 1.3703 1.7359 1.2750 1.3376 1.3773 1.4714 2.5397 8.7039 1.2627 2.1875 1.1134 1.0398 1.0613 1.1156 2.1816 1.0943 1.8315 6.1455 1.3832 6.1763 9.8158 4.1769 9.5442 1.0625 1.0360 1.0584 1.0582 1.0826 1.0988 1.1065 1.1072 1.0985 1.1027 1.0849 1.0881 1.0923 1.0965 1.1017 1.0449 1.0770 1.1042
irintensity: 0.0017 0.0059 0.0998 1.8008 9.3676 5.6628 8.6067 2.0582 0.4486 1.9551 1.0730 1.5775 8.5757 3.1909 4.3596 11.4661 14.6265 1.2520 6.2876 5.8099 3.6413 3.7248 8.3173 0.0880 14.9194 20.8602 44.3693 168.1898 61.5011 13.4569 22.7044 45.4657 0.1663 78.5717 35.5032 4.9505 16.5020 54.7010 20.6228 61.7571 3.6751 5.4440 14.9095 0.0024 0.3636 11.2292 3.4868 68.0216 24.1970 3.6751 0.1050 392.2551 9.9991 1.9653 80.0669 1.1266 14.5751 11.2331 7.1501 12.8160 16.7758 183.9721 174.9692 4.2968 258.2738 2.8036 3.1012 121.1062 9.4437 0.5836 98.1720 57.1170 1.6305 108.4524 0.7399 4.5547 114.8784 0.3487 20.9365 9.2920 54.3790 12.9741 8.6202 23.2247 33.0006 14.2098 301.7907 0.8620 65.1939 0.1098 227.2339 130.3504 350.3948 23.2216 20.6086 20.1555 22.9317 14.0538 9.5837 6.7572 12.6828 29.3412 40.2420 3.5250 0.8913 17.1549 41.0006 21.0670 33.4224 27.1524 24.2021
temp: 298.150 k
press: 1.00000 atm
elementType: 8 8 8 8 8 7 7 6 6 6 6 6 6 6 6 6 6 6 6 6 6 1 1 1 1 1 1 1 1 1 1 1 1 1 1 1 1 1 1
symmnumber: 1
zpe: 807939.1 jmol-1
zpe.correction: 0.307728 hartree
zpe.thermalcorrener: 0.329033 hartree
zpe.thermalcorrenthalpy: 0.329977 hartree
zpe.thermalcorrgfe: 0.252280 hartree
zpe.sumelectzpe: -1028.368250 hartree
zpe.sumelectthermal: -1028.346944 hartree
zpe.sumelectthermalent: -1028.346000 hartree
zpe.sumelectthermalfe: -1028.423697 hartree
dipole: -1.3659 1.3730 -5.2751
dipole: 5.6194
quadrupole: -93.7018 -109.3188 -125.9268
quadrupole: 5.4861 8.6178 -12.9843
quadrupole: 15.9473 0.3303 -16.2777 5.4861 8.6178 -12.9843
hfenergy: -1028.6759773 hartree
pointgroup: C01 [X(C14H18N2O5)]
dipole: 0.6308505 -0.6225161 -2.0254131 debye
polarizability: 224.9329958|19.0397187|172.9908355|20.2827435|-9.1533577|146.285484 unknown
InChI: InChI=1S/C14H18N2O5/c1-2-20-13(18)11(8-12(15)17)16-14(19)21-9-10-6-4-3-5-7-10/h3-7,11,16H,2,8-9,15H2,1H3
charge 0 multiplicity 1
39 atoms
O  4.109912 1.39415 0.063767
O  -1.4193 0.077121 0.179379
O  2.2020 2.110616 -1.071358
O  2.60619 -2.691951 1.370408
O  0.106985 0.534032 1.922944
N  0.801174 -0.194485 -0.206275
N  2.574633 -3.703594 -0.717358
C  2.229357 -0.107049 0.068077
C  3.008021 -1.271944 -0.592443
C  2.801879 1.251221 -0.389975
C  2.700501 -2.602855 0.113696
C  -0.132808 0.177464 0.742653
C  -2.530577 0.474608 1.10475
C  -3.832017 0.210454 0.388036
C  4.790433 2.687871 -0.267747
C  -4.35039 1.153946 -0.535128
C  -4.554587 -0.984924 0.62737
C  6.170447 2.63706 0.378078
C  -5.565468 0.905334 -1.210536
C  -5.772393 -1.236273 -0.044101
C  -6.280007 -0.291142 -0.965433
H  2.365222 -0.187253 1.162736
H  4.089009 -1.072146 -0.476024
H  2.790921 -1.321632 -1.677208
H  0.472367 -0.301916 -1.166834
H  -2.433887 -0.1146 2.033376
H  -2.395264 1.542629 1.354061
H  4.836034 2.782059 -1.367975
H  4.166527 3.510861 0.124198
H  -3.796977 2.081398 -0.725441
H  -4.160301 -1.719643 1.33979
H  2.624114 -3.630909 -1.731692
H  2.405268 -4.615271 -0.291935
H  6.714236 3.57671 0.170587
H  6.764983 1.797085 -0.020259
H  6.087897 2.517515 1.471526
H  -5.956828 1.641635 -1.921402
H  -6.323761 -2.162771 0.15128
H  -7.225445 -0.483109 -1.485389
