program: Gaussian 09
title: 000109956
version: EM64L-G09RevD.01
frameworkgroup: C1[X(C24H29N)]
method: RPBEPBE
basis: SDD
operation: Freq
keyword: #pfreq=noraman
keyword: PBEPBE/SDD
title: #p freq=noraman PBEPBE/SDD
converged: YES YES NO NO
title: Mulliken charges:
elementType: N C C C C C C C C C C C C C C C C C C C C C C C C H H H H H H H H H H H H H H H H H H H H H H H H H H H H H
charge: -0.520642 0.139808 -0.417225 0.301117 0.539312 -0.721582 -0.780079 -0.731442 -0.729144 -0.718075 -0.669646 -0.450416 0.430491 0.156651 -0.420475 0.301592 -0.501444 -0.420368 -0.243458 0.471528 -0.449908 -0.392582 -0.197894 -0.215432 -0.266872 0.190044 0.193344 0.219814 0.223459 0.208585 0.213214 0.222392 0.213623 0.212276 0.210583 0.211197 0.205016 0.206478 0.231714 0.201149 0.229633 0.218049 0.235438 0.251466 0.211400 0.241298 0.265974 0.223800 0.300306 0.222828 0.268836 0.223365 0.223234 0.227671
chargesum: 0.00000
title: Mulliken charges with hydrogens summed into heavy atoms:
elementType: N C C C C C C C C C C C C C C C C C C C C C C C C
charge: -0.220337 0.139808 -0.033837 0.301117 0.539312 -0.069724 -0.130850 -0.097386 -0.085936 -0.069244 -0.434208 -0.198950 0.430491 0.156651 -0.209075 0.301592 -0.260147 -0.154394 -0.019657 0.471528 -0.227079 -0.123746 0.025471 0.007802 -0.039201
polarizability: 4.35404841e+02 8.53916444e+00 2.60160450e+02 -3.19577110e+01 8.79238915e+00 1.86223632e+02
1716.lowfreq: -15.0423 -3.5733 -0.0002 0.0005 0.0007 5.0091 15.5051 28.9371 38.4613
frequency: 11.4405 28.7172 38.4189 46.8119 51.5863 72.7304 105.7607 142.5122 153.4627 172.5750 176.7319 205.1179 208.1595 234.0624 240.7336 245.9786 255.0485 272.1456 277.6759 281.7688 298.5115 314.7493 333.0460 352.9992 355.8921 372.8882 391.4247 408.4441 409.4751 420.4955 438.8570 461.9744 487.1591 494.5209 512.3219 516.6506 521.8759 551.7684 577.9440 599.8444 615.0757 621.9416 670.6752 673.1255 693.0312 735.8423 747.0357 762.1244 770.7785 796.3634 803.2362 811.5223 827.8217 830.8219 849.7630 866.4891 878.2764 897.3968 900.8800 916.8485 919.4065 926.3989 933.0021 937.3504 942.5439 961.7532 963.4447 972.5637 977.6721 982.1807 984.1137 1003.7742 1020.9088 1022.0658 1031.0609 1041.6122 1078.7122 1093.4395 1104.6763 1124.8627 1159.4106 1170.3536 1177.3218 1184.9172 1191.3371 1196.8699 1217.4437 1229.9623 1240.6382 1249.4931 1261.5656 1280.7729 1297.2294 1319.7762 1324.0448 1341.0610 1349.1591 1371.3166 1374.6996 1376.7436 1379.0603 1387.9704 1396.9962 1402.6894 1417.0205 1436.3157 1443.7010 1453.8036 1458.4063 1459.6310 1461.9691 1464.7859 1468.9499 1471.2079 1479.1548 1481.6194 1487.2556 1487.5128 1496.8006 1499.5783 1502.4571 1529.1925 1583.1435 1594.1302 1599.1490 1617.2704 1632.2549 2952.7423 2961.7832 2969.7296 2970.0818 2975.7700 2979.2414 3010.8314 3053.5502 3059.3361 3061.4612 3065.6381 3067.5759 3068.4073 3076.3437 3080.9086 3084.7462 3093.8309 3111.3470 3116.5048 3118.6723 3125.6292 3128.3922 3140.3311 3146.6547 3159.6278 3159.9172 3167.7591 3172.7016 3541.5225
redmass: 4.2964 3.7171 3.7900 4.2248 3.1217 4.1990 4.2264 4.3197 3.4299 1.9381 3.5586 2.7899 1.3183 3.7986 1.1500 1.3424 3.5513 1.4569 2.1410 1.6509 2.3278 3.2407 3.5064 1.2950 2.0695 2.3657 2.5842 2.8627 2.0333 2.7666 2.6656 2.0469 2.3655 2.6288 3.0324 2.4357 3.9843 3.1330 6.4874 4.5540 5.8279 4.9474 3.5109 3.2975 2.1009 3.5032 2.1609 1.8024 2.5846 3.7554 2.4056 2.2651 1.5226 1.7842 3.0076 2.1854 1.4093 2.2996 1.5276 1.7947 1.9207 1.6043 1.6425 1.3214 1.6285 1.3711 1.3708 1.3453 1.7131 5.2671 1.3231 1.3092 1.7005 1.8975 1.4153 2.9197 1.8094 1.6748 1.8542 2.6046 1.6752 1.0520 1.2640 1.3106 1.3107 2.0581 2.3806 2.1835 2.0710 3.0671 3.1386 1.7464 1.8621 1.8076 1.5448 1.3157 1.7160 1.2887 1.3204 1.2191 2.0168 6.2696 1.2362 1.2096 6.5177 2.9188 2.5920 1.1310 1.3439 1.3315 1.0512 1.0485 1.2078 1.0739 1.0590 1.0584 1.6140 1.3112 1.0950 2.2360 1.0785 2.8189 6.9780 5.9492 4.2664 6.2409 6.1833 1.0601 1.0355 1.0364 1.0348 1.0373 1.0368 1.0977 1.0996 1.0994 1.0996 1.0994 1.0982 1.0994 1.0997 1.0992 1.0993 1.0958 1.0878 1.0893 1.0879 1.0859 1.0864 1.0929 1.0943 1.0947 1.0937 1.0980 1.0972 1.0747
irintensity: 0.0438 0.0587 0.6010 0.2065 0.1845 0.1462 0.8102 0.1469 0.4026 0.0277 0.4346 0.0162 0.1663 3.7082 0.4027 0.1126 5.8804 0.3716 0.1372 0.1818 0.4611 1.0128 3.4602 0.2455 0.1032 1.7244 5.5855 0.6831 0.2305 2.5373 6.7850 48.0700 55.2830 1.7619 0.1046 28.7699 2.0782 9.2586 7.2636 2.8376 5.6783 1.4049 2.6619 1.1730 38.3453 0.2322 90.4009 6.7651 31.6036 2.7753 19.5556 14.6699 6.3107 15.5042 14.5352 0.8257 9.8691 3.5067 1.3113 3.2602 7.0326 9.3061 10.6948 4.1399 6.9972 0.5422 0.8553 3.3755 7.1736 2.7939 0.5666 1.5688 0.8711 3.2269 0.2316 11.2336 3.6297 13.8821 17.9926 2.6006 6.5705 0.7674 2.1635 16.2076 0.4393 4.6173 9.0916 32.4744 1.5305 17.9202 11.4389 9.9446 18.5743 91.3166 20.4027 8.5070 0.2198 12.4086 19.9569 11.3236 80.4975 6.6019 21.2649 15.6335 11.5370 25.6173 141.4911 3.9720 4.2314 0.9586 1.4733 3.0145 2.9040 4.6466 18.3757 11.6821 99.9800 55.9395 43.5884 153.0829 3.7672 268.5747 130.8727 118.3076 11.8562 151.7256 33.3839 29.5162 40.5865 34.3263 59.9310 20.1569 31.0325 28.6715 6.8514 48.5340 8.7724 10.9521 122.9130 87.2446 38.1872 38.2080 43.8427 39.1853 15.5049 30.7582 0.6614 1.5950 3.3502 26.8579 37.7343 27.6050 22.7929 5.4147 15.4784 14.4130
temp: 298.150 k
press: 1.00000 atm
elementType: 7 6 6 6 6 6 6 6 6 6 6 6 6 6 6 6 6 6 6 6 6 6 6 6 6 1 1 1 1 1 1 1 1 1 1 1 1 1 1 1 1 1 1 1 1 1 1 1 1 1 1 1 1 1
symmnumber: 1
zpe: 1212774.4 jmol-1
zpe.correction: 0.461921 hartree
zpe.thermalcorrener: 0.486052 hartree
zpe.thermalcorrenthalpy: 0.486996 hartree
zpe.thermalcorrgfe: 0.408002 hartree
zpe.sumelectzpe: -984.893166 hartree
zpe.sumelectthermal: -984.869035 hartree
zpe.sumelectthermalent: -984.868091 hartree
zpe.sumelectthermalfe: -984.947085 hartree
dipole: 0.9122 -0.8844 -0.4510
dipole: 1.3482
quadrupole: -142.4409 -142.0638 -155.7424
quadrupole: 2.4879 -2.4798 4.3918
quadrupole: 4.3081 4.6853 -8.9934 2.4879 -2.4798 4.3918
hfenergy: -985.3550873 hartree
pointgroup: C01 [X(C24H29N1)]
dipole: -0.3592263 0.1025356 -0.3765414 debye
polarizability: 438.0882891|18.2780811|205.2142203|9.4601732|-35.5383791|238.4864133 unknown
InChI: InChI=1S/C24H29N/c1-23(2,3)17-24(4,5)19-14-15-21-18(16-19)10-9-13-22(21)25-20-11-7-6-8-12-20/h6-16,25H,17H2,1-5H3
charge 0 multiplicity 1
54 atoms
N  2.932353 -0.107387 -0.692958
C  -3.76598 -0.130315 -1.09608
C  -4.664332 0.022448 0.18803
C  -4.721274 1.339297 1.04376
C  -2.257972 -0.244648 -0.751441
C  -4.183909 -1.485167 -1.761215
C  -4.049376 0.986382 -2.133092
C  -5.356545 0.943615 2.410381
C  -5.643977 2.413624 0.399963
C  -3.32385 1.954211 1.317358
C  -1.808102 -1.1719 0.20064
C  -1.261142 0.543629 -1.41612
C  -0.423353 -1.355977 0.51307
C  0.569843 -0.574976 -0.194081
C  0.101659 0.38602 -1.145443
C  1.977077 -0.795553 0.089896
C  -0.005959 -2.288889 1.520146
C  2.344612 -1.720298 1.084059
C  1.35182 -2.450345 1.800397
C  4.273757 0.21472 -0.38363
C  5.169627 0.473888 -1.460784
C  4.750672 0.352106 0.950925
C  6.502634 0.85653 -1.210801
C  6.089815 0.726526 1.187069
C  6.978672 0.979062 0.115889
H  -5.70673 -0.200069 -0.125907
H  -4.38261 -0.799541 0.876725
H  -4.080241 -2.329119 -1.055423
H  -3.550601 -1.700603 -2.641295
H  -5.238667 -1.442826 -2.093192
H  -3.574221 0.752081 -3.104289
H  -5.137316 1.068733 -2.305846
H  -3.683976 1.974887 -1.805871
H  -4.706303 0.238287 2.961782
H  -6.341929 0.459605 2.267163
H  -5.505372 1.836912 3.046089
H  -6.650485 1.999837 0.195864
H  -5.765635 3.270101 1.090571
H  -5.239761 2.806515 -0.547242
H  -3.42142 2.819802 2.00056
H  -2.644365 1.220508 1.786677
H  -2.837857 2.30917 0.391534
H  -2.528084 -1.794429 0.746426
H  -1.564852 1.300024 -2.145748
H  0.812182 1.050016 -1.65219
H  -0.762874 -2.869636 2.059202
H  3.401546 -1.920337 1.278931
H  1.674716 -3.167154 2.563644
H  2.638629 0.129575 -1.641557
H  4.815968 0.365916 -2.494416
H  4.070967 0.200334 1.793903
H  7.173458 1.051024 -2.055358
H  6.436985 0.833546 2.221292
H  8.016478 1.268735 0.310132
