program: Gaussian 09
title: 000008761
version: EM64L-G09RevD.01
frameworkgroup: C1[X(C6H13NO4)]
method: RPBEPBE
basis: SDD
operation: Freq
keyword: #p
keyword: freq=noraman
keyword: PBEPBE/SDD
title: #p freq=noraman PBEPBE/SDD
converged: YES YES NO NO
title: Mulliken charges:
elementType: O O O O N C C C C C C H H H H H H H H H H H H H
charge: -0.438349 -0.458307 -0.414979 -0.240769 -0.092505 -0.376311 -0.357040 -0.458598 -0.303334 -0.309791 0.201940 0.185973 0.225308 0.223804 0.215032 0.257007 0.248469 0.218944 0.205558 0.220900 0.192682 0.330895 0.345698 0.377773
chargesum: 0.00000
title: Mulliken charges with hydrogens summed into heavy atoms:
elementType: O O O O N C C C C C C
charge: -0.107454 -0.112609 -0.037206 -0.240769 -0.092505 0.034971 0.081796 0.046877 0.121168 0.103791 0.201940
polarizability: 9.21743471e+01 -1.24370785e+00 8.60612688e+01 3.60742134e+00 1.50715924e+00 7.80520757e+01
1716.lowfreq: -20.9602 0.0011 0.0011 0.0011 5.9858 8.8493 15.4281 41.5123 64.8135
frequency: -13.8773 41.3362 64.8095 70.4886 80.0515 87.4658 105.3935 200.5134 233.4084 264.3153 278.9198 307.3703 330.2880 339.7814 396.7732 461.1633 498.6963 514.2837 600.6470 635.2466 785.7068 797.6248 808.6440 877.3177 952.2348 954.5909 972.7679 992.2232 1011.1689 1027.7935 1045.2091 1086.2801 1138.5391 1169.2894 1201.9922 1203.7741 1249.8659 1270.7836 1284.0778 1298.8333 1338.3420 1346.7390 1356.2103 1362.6289 1374.8047 1381.6990 1405.6124 1410.4073 1442.5446 1450.8876 1470.3765 1483.1888 1668.2306 2921.4777 2951.3750 2961.3265 2973.8737 2991.4426 3009.3914 3019.1128 3024.1435 3049.4214 3101.3119 3506.1582 3558.8875 3578.1724
redmass: 1.9976 5.7336 4.3162 2.6537 6.7425 4.8042 2.7923 5.4478 2.9732 1.0973 1.8830 2.2574 2.6371 2.7302 7.1105 1.7718 2.9496 3.2133 4.8647 1.3712 1.1498 4.0835 1.2070 4.0491 4.5381 2.7404 4.3512 2.9818 3.4470 3.1943 1.6174 1.7925 1.3887 1.3613 1.3706 1.2264 1.6786 1.5203 1.1994 1.1530 1.3706 1.3795 1.3029 1.6319 1.7912 1.2320 1.1574 1.3119 1.0758 1.0873 1.0873 1.0833 8.3544 1.0663 1.0592 1.0582 1.0589 1.0685 1.0997 1.1011 1.0925 1.1075 1.0996 1.0643 1.0662 1.0667
irintensity: 11.4638 1.4711 0.6537 2.2907 0.6152 4.9981 3.6192 2.8579 3.5436 154.3548 60.2749 108.9331 2.5396 11.4858 16.1991 15.5858 32.7663 21.1511 20.0392 133.2480 8.3458 7.5806 7.6455 10.4811 174.6451 59.1773 60.9089 20.3663 110.8905 160.0584 30.3696 3.1216 19.4171 12.6129 29.1264 20.7617 16.9000 13.0875 5.6320 2.4349 16.1374 15.9127 14.2259 9.2544 40.5426 2.7558 26.5271 13.1740 11.2855 13.4058 3.8373 6.1690 202.5381 77.1207 38.2812 29.8128 74.2940 31.9889 9.8122 7.5068 30.1553 83.2800 35.5992 16.1310 6.0876 3.8301
temp: 298.150 k
press: 1.00000 atm
elementType: 8 8 8 8 7 6 6 6 6 6 6 1 1 1 1 1 1 1 1 1 1 1 1 1
symmnumber: 1
zpe: 513063.0 jmol-1
zpe.correction: 0.195415 hartree
zpe.thermalcorrener: 0.208218 hartree
zpe.thermalcorrenthalpy: 0.209162 hartree
zpe.thermalcorrgfe: 0.155081 hartree
zpe.sumelectzpe: -591.132771 hartree
zpe.sumelectthermal: -591.119969 hartree
zpe.sumelectthermalent: -591.119024 hartree
zpe.sumelectthermalfe: -591.173105 hartree
dipole: 2.6556 -0.7931 0.5069
dipole: 2.8174
quadrupole: -63.5552 -69.4880 -67.1167
quadrupole: 2.7801 2.8900 9.4753
quadrupole: 3.1648 -2.7680 -0.3967 2.7801 2.8900 9.4753
hfenergy: -591.3281864 hartree
pointgroup: C01 [X(C6H13N1O4)]
dipole: 0.7226691 0.8147225 0.2065481 debye
dipolederiv: -0.8929954 0.2291742 -0.0424519 0.2483396 -0.3475653 0.2458309 -0.0244994 0.2613305 -0.4480473 -0.6063925 0.0921555 0.0194073 0.0716596 -0.9694521 -0.0786728 0.0118313 -0.0439216 -0.1354854 -0.9845155 -0.4925083 -0.1383202 -0.4957261 -0.8428161 -0.1182291 -0.0569644 -0.0486935 -0.2557775 -0.5719662 -0.2142645 0.0095377 -0.2194902 -0.5137896 0.0001951 -0.2356839 -0.211932 -0.8700405 -0.7550357 0.0182282 0.0078547 -0.0134375 -0.7298389 -0.0010497 -0.067784 -0.0259891 -0.6044589 0.5886998 -0.1893705 0.0191413 -0.2138879 0.2055641 0.0279264 -0.0105629 0.0279871 0.2690632 0.1304681 -0.0917071 -0.0224834 -0.0885549 0.6908345 0.0403537 -0.034112 0.030223 0.2879315 0.5098778 0.337283 -0.0223079 0.3450237 0.3870919 -0.0190495 0.0415135 0.0330613 0.070654 0.613078 -0.114041 0.0096262 -0.1387538 0.3393196 -0.055165 -0.0652171 -0.0297177 0.1999658 0.4267086 -0.090563 0.0105732 -0.0686695 0.6641744 0.056297 0.0202893 -0.0238968 0.0771917 0.9700158 0.7042958 0.0838148 0.7027903 0.7676823 0.0791064 0.2819137 0.2486991 1.0036211 0.019059 0.0400326 -0.0148524 0.128725 -0.1488295 -0.155445 0.0053056 -0.1113151 -0.0494914 -0.0435971 -0.0821512 0.0448833 -0.1264278 -0.0302652 0.0917664 0.0116954 0.0734278 0.0300856 -0.0409258 -0.1333356 0.1111216 -0.0702585 -0.0264288 0.044244 0.091185 0.0215231 0.0095453 -0.1044416 0.0936926 -0.1222272 0.0341935 0.0404572 -0.0061396 -0.097234 -0.0065715 0.0036913 -0.1011013 0.0012024 -0.0624389 0.0617097 0.0848186 0.0882233 -0.0452584 0.0506958 0.0612694 0.0842326 0.0341367 0.082095 -0.0281848 -0.1109193 -0.0819986 0.0444668 -0.0578394 0.0543014 0.0511857 0.0055526 0.0040745 0.0286911 -0.0452791 -0.1078997 0.0322589 -0.1040141 -0.0143601 -0.0747414 -0.0676555 0.0538926 -0.1090871 -0.0854971 0.0824738 0.0265983 0.0577547 0.0104433 -0.0775168 -0.0809532 0.0849804 -0.037244 -0.0408546 0.0505006 0.0682425 0.0664565 -0.0032121 -0.1543525 0.0782786 -0.122127 0.037992 -0.0226522 0.0131943 -0.1136166 0.0454095 -0.0188998 0.2932282 -0.0620273 -0.0358913 -0.0356802 0.1268577 -0.1787142 0.0221147 -0.2198324 0.2283463 0.3859141 0.0304173 0.0093933 0.0321821 0.2586998 -0.0422175 0.0196812 -0.0927917 0.0108157 0.3351141 -0.0458724 0.0327043 -0.0459043 0.3486878 0.0244687 0.0738367 0.0599465 0.0828474 unknown
polarizability: 88.086921|3.1516203|90.046776|0.138617|4.0474796|78.1539945 unknown
InChI: InChI=1S/C6H13NO4/c8-3-1-7(2-4-9)5-6(10)11/h8-10H,1-5H2
charge 0 multiplicity 1
24 atoms
O  -3.575182 1.088212 -0.501182
O  0.453313 -3.602819 -0.417177
O  2.432541 2.158599 0.042351
O  1.063241 0.953832 -1.397178
N  -0.295943 -0.204228 1.000932
C  -1.670209 0.291541 0.892389
C  -0.020354 -1.638318 0.870742
C  0.796861 0.73185 1.094948
C  -2.151419 0.706181 -0.5269
C  0.120133 -2.174568 -0.572682
C  1.395883 1.251043 -0.231218
H  -1.790904 1.168213 1.569128
H  -2.361623 -0.491392 1.260807
H  -0.82704 -2.211531 1.368501
H  0.920183 -1.878348 1.405777
H  1.643556 0.289876 1.659759
H  0.491809 1.633083 1.666928
H  -2.103596 -0.148435 -1.219583
H  -1.522136 1.51895 -0.941215
H  0.916263 -1.628313 -1.115561
H  -0.833784 -2.048447 -1.126152
H  -3.678171 1.914519 0.035566
H  0.545032 -4.020229 -1.309448
H  2.824145 2.48753 -0.812133
