program: Gaussian 09
title: 000107342
version: EM64L-G09RevD.01
frameworkgroup: C1[X(C24H30O4)]
method: RPBEPBE
basis: SDD
operation: Freq
keyword: #pfreq=noraman
keyword: PBEPBE/SDD
title: #p freq=noraman PBEPBE/SDD
converged: NO YES NO NO
title: Mulliken charges:
elementType: O O O O C C C C C C C C C C C C C C C C C C C C C C C C H H H H H H H H H H H H H H H H H H H H H H H H H H H H H H
charge: -0.286498 -0.286468 -0.229670 -0.229702 -0.241332 -0.241314 -0.417686 -0.417720 0.553757 0.553731 -0.709386 -0.709381 -0.402477 -0.402533 -0.424350 -0.424310 -0.351138 -0.351082 -0.405853 -0.405873 0.343501 0.343445 0.246637 0.246679 -0.484362 -0.484367 -0.657534 -0.657538 0.211444 0.211424 0.199000 0.215072 0.215075 0.198992 0.207720 0.237962 0.213645 0.213642 0.237967 0.207722 0.228246 0.228242 0.235472 0.235470 0.298064 0.298094 0.252534 0.252534 0.246059 0.245930 0.245936 0.246054 0.228770 0.216015 0.230477 0.228757 0.216017 0.230491
chargesum: 0.00000
title: Mulliken charges with hydrogens summed into heavy atoms:
elementType: O O O O C C C C C C C C C C C C C C C C C C C C C C C C
charge: -0.286498 -0.286468 -0.229670 -0.229702 -0.029889 -0.029891 -0.003614 -0.003652 0.553757 0.553731 -0.050059 -0.050050 -0.174231 -0.174290 -0.188878 -0.188840 -0.053074 -0.052988 -0.153319 -0.153339 0.343501 0.343445 0.246637 0.246679 0.007627 0.007624 0.017727 0.017726
polarizability: 3.02701200e+02 -1.23971517e-02 3.18138687e+02 -3.09290755e+01 1.07311115e-03 2.17476209e+02
1716.lowfreq: -8.0667 -6.4200 -0.0007 0.0003 0.0008 3.4541 8.6273 12.9456 17.7148
frequency: 8.3487 12.4173 17.6467 19.3683 27.7642 29.1624 33.5112 50.3754 50.6150 64.8766 67.5528 83.9973 89.0086 106.2978 134.4550 144.7832 157.6821 165.3994 181.4605 182.7865 190.5745 203.1266 222.7240 234.9055 244.6547 258.4173 277.7057 285.5824 312.7249 326.4892 340.4130 347.9326 367.3927 375.3398 410.9354 411.5065 444.9762 451.9330 493.2307 527.5680 531.5661 542.3631 550.4627 576.0274 581.3261 619.9657 620.8520 658.2163 660.9629 710.9438 711.2755 736.4670 737.7300 778.4337 778.8479 790.7181 790.7497 816.5727 837.1613 840.7952 844.9246 848.8412 850.6582 854.8214 856.0108 885.5667 931.1010 959.2061 963.5049 976.8527 977.6679 998.7663 1006.5829 1007.1066 1011.3877 1012.2527 1027.9952 1056.2339 1070.5020 1074.0496 1079.3340 1084.2273 1084.2368 1085.5412 1093.3244 1095.0479 1109.6382 1113.5377 1116.9713 1128.9468 1150.3490 1152.6345 1193.1221 1193.7291 1204.6386 1205.4575 1225.5051 1242.4350 1242.4727 1244.7945 1246.5718 1293.5328 1298.0140 1307.1518 1322.9943 1324.3997 1329.7933 1334.0200 1334.2605 1337.1506 1381.7483 1382.2858 1395.3268 1395.8817 1399.9293 1399.9498 1412.4791 1413.1142 1440.5897 1440.6885 1471.8572 1472.0440 1472.0604 1472.6926 1476.5398 1476.9128 1480.8086 1480.8704 1486.6196 1486.9796 1488.1592 1488.5509 1584.6624 1585.3019 1614.1470 1614.6303 1651.1311 1651.3093 2956.0286 2965.5869 2972.9489 2976.6553 2977.2388 2979.0921 2997.2486 2997.2692 3000.6384 3000.6519 3032.5196 3039.1884 3044.5429 3044.5454 3067.4105 3067.4580 3085.4696 3086.3735 3097.8522 3097.8720 3103.0861 3103.0938 3123.1917 3123.4389 3131.3143 3131.7129 3166.7013 3166.7470 3206.6096 3206.7103
redmass: 4.3762 2.5366 2.3422 3.5454 5.1417 6.1238 3.2039 3.7260 3.4289 4.1730 3.4121 4.5353 3.8029 2.8943 1.9483 3.1827 3.1880 2.1947 1.7691 3.1690 1.2580 1.7657 3.9536 1.4986 1.3984 4.7248 3.2545 3.7552 4.0255 3.4566 5.0530 5.0999 4.3893 5.8504 2.9560 2.9558 3.6615 3.2550 3.1118 2.6938 2.7633 2.6613 4.4311 4.0665 2.7156 6.4320 6.3102 4.4967 4.6439 3.4990 2.7215 3.9651 3.2086 2.8979 3.3034 1.3411 1.3415 1.6498 1.3301 1.2872 1.5725 1.7945 1.8191 3.8266 3.3071 1.9783 1.6865 1.4063 1.3818 1.3483 1.3505 4.6242 2.8850 2.7580 1.9292 1.9553 1.7848 1.6807 2.5813 2.7504 2.0782 1.6045 1.6038 1.9078 2.1864 2.3620 2.5136 3.0909 1.6150 1.4776 2.2550 2.2578 1.3124 1.3606 1.8048 2.8073 1.7750 1.1737 1.1736 1.3009 1.3638 1.3270 1.3045 1.1389 1.5960 1.5069 1.3935 1.7419 1.7450 1.3915 4.5906 4.8085 1.2244 1.2078 1.2141 1.2141 2.8566 2.8398 1.0859 1.0857 1.0667 1.0390 1.0390 1.0593 1.0428 1.0489 1.0579 1.0552 1.2072 1.2916 1.7659 1.9475 7.2407 7.1041 6.5247 6.5158 9.6544 9.6319 1.0802 1.0712 1.0651 1.0386 1.0368 1.0736 1.0553 1.0555 1.0418 1.0416 1.0984 1.0955 1.0986 1.0986 1.0993 1.0992 1.0998 1.0994 1.1003 1.1003 1.1004 1.1004 1.0899 1.0899 1.0893 1.0894 1.0955 1.0955 1.0940 1.0940
irintensity: 0.1911 1.7003 0.1671 0.3807 1.3805 0.4407 2.8506 0.4846 0.5953 0.0721 0.6984 0.1147 0.5334 2.3399 0.0049 0.1609 0.2406 0.5037 0.0362 0.0709 0.4980 0.3618 1.8320 0.0449 0.1452 0.1134 8.8007 10.3701 1.0662 0.4751 11.3958 5.3074 0.1265 0.4413 0.0003 0.1759 0.2655 0.5188 3.3172 3.2682 0.4475 7.0894 7.5355 0.0017 35.6706 0.0395 2.1648 2.0580 2.7471 0.5710 7.3062 0.0081 5.9721 9.9106 0.3086 24.8205 6.5819 31.5702 1.1963 8.5343 31.8134 0.0364 74.8116 29.7412 6.5253 16.6494 2.2340 0.0001 1.6292 0.5273 1.5720 0.1631 2.1176 0.9080 52.2208 52.0076 2.0527 0.1236 235.7617 93.6509 28.5452 0.1186 0.1371 0.1192 14.2624 15.9374 457.9341 333.2681 78.9497 51.9429 172.5577 132.6731 48.8307 44.7525 37.6670 53.6498 7.8670 0.0393 0.1115 2.8442 0.1869 6.4402 12.7036 0.5913 11.6192 0.6682 1.3133 49.2455 50.8389 5.5469 4.7540 9.5956 23.5335 0.8426 34.6949 8.6233 4.0664 6.0313 23.4360 30.8238 1.6025 16.2386 8.6936 8.7097 4.7064 14.0621 14.0748 36.2222 2.5995 43.4486 49.6619 127.2967 2.8651 2.5680 5.6154 4.2396 348.1357 2.8884 1.5650 15.5927 23.3431 76.7030 10.3825 37.3341 56.1033 6.9964 14.9890 14.2125 30.9557 30.8469 6.0828 1.5580 28.9972 61.5652 32.4598 79.4742 13.8299 43.9370 43.8672 18.8048 17.9708 11.7263 6.2124 22.4730 3.5608 5.7799 2.7074 2.6990
temp: 298.150 k
press: 1.00000 atm
elementType: 8 8 8 8 6 6 6 6 6 6 6 6 6 6 6 6 6 6 6 6 6 6 6 6 6 6 6 6 1 1 1 1 1 1 1 1 1 1 1 1 1 1 1 1 1 1 1 1 1 1 1 1 1 1 1 1 1 1
symmnumber: 1
zpe: 1262547.2 jmol-1
zpe.correction: 0.480879 hartree
zpe.thermalcorrener: 0.511055 hartree
zpe.thermalcorrenthalpy: 0.511999 hartree
zpe.thermalcorrgfe: 0.412621 hartree
zpe.sumelectzpe: -1231.375393 hartree
zpe.sumelectthermal: -1231.345217 hartree
zpe.sumelectthermalent: -1231.344273 hartree
zpe.sumelectthermalfe: -1231.443651 hartree
dipole: -0.0002 -0.8682 0.0009
dipole: 0.8682
quadrupole: -174.6789 -142.8846 -168.3742
quadrupole: 0.0006 10.0051 -0.0024
quadrupole: -12.6997 19.0946 -6.3949 0.0006 10.0051 -0.0024
hfenergy: -1231.8562718 hartree
pointgroup: C01 [X(C24H30O4)]
dipole: 0.3415833 -0.0000657 -0.0003825 debye
polarizability: 318.1386782|-0.0210069|287.5814814|-0.0103673|-44.9063475|232.5959363 unknown
InChI: InChI=1S/C24H30O4/c1-5-21(17-9-13-19(14-10-17)27-23(25)7-3)22(6-2)18-11-15-20(16-12-18)28-24(26)8-4/h9-16,21-22H,5-8H2,1-4H3
charge 0 multiplicity 1
58 atoms
O  1.938658 -3.857846 0.171026
O  1.941115 3.85665 -0.170753
O  1.64606 -4.898168 2.267191
O  1.648486 4.897135 -2.266771
C  -2.805821 -0.596125 -0.517661
C  -2.805457 0.597969 0.51774
C  -4.117185 -1.435626 -0.480664
C  -4.116287 1.438303 0.480736
C  -1.568898 -1.475019 -0.305797
C  -1.567943 1.476056 0.305948
C  -4.127458 -2.602817 -1.491841
C  -4.125859 2.605459 1.491965
C  -1.427519 -2.268184 0.860912
C  -1.426254 2.269587 -0.86048
C  -0.524168 -1.516295 -1.26261
C  -0.523003 1.516246 1.262581
C  -0.294224 -3.079865 1.087971
C  -0.292437 3.080561 -1.087446
C  0.618687 -2.316345 -1.063025
C  0.620397 2.315535 1.063057
C  0.728463 -3.093783 0.109915
C  0.730467 3.093331 -0.109616
C  2.318896 -4.703366 1.233984
C  2.321554 4.701971 -1.233785
C  3.669518 -5.320257 0.90339
C  3.672847 5.317732 -0.903792
C  4.153316 -6.3062 1.980631
C  4.156821 6.303521 -1.981081
H  -2.733434 -0.148855 -1.531492
H  -2.733369 0.150619 1.531555
H  -4.279067 -1.828927 0.544086
H  -4.974855 -0.773244 -0.700354
H  -4.974393 0.776463 0.700363
H  -4.277875 1.831756 -0.544002
H  -3.966407 -2.234298 -2.523051
H  -3.333699 -3.337852 -1.271677
H  -5.098175 -3.131499 -1.471001
H  -5.09624 3.134758 1.471114
H  -3.331623 3.339994 1.271855
H  -3.965079 2.236795 2.523165
H  -2.220995 -2.265669 1.618229
H  -2.219917 2.267978 -1.617602
H  -0.60064 -0.907817 -2.171217
H  -0.599741 0.907497 2.170984
H  -0.205481 -3.683446 1.991459
H  -0.203458 3.684476 -1.990699
H  1.428307 -2.348319 -1.798299
H  1.430187 2.346667 1.79818
H  3.585487 -5.81066 -0.085145
H  4.391796 -4.49282 0.763045
H  4.394555 4.4897 -0.764023
H  3.589744 5.807973 0.084903
H  3.445034 -7.14397 2.09884
H  5.139806 -6.718315 1.704841
H  4.242834 -5.809416 2.961651
H  3.449273 7.14202 -2.098526
H  5.143912 6.714598 -1.705889
H  4.245138 5.806951 -2.962317
