program: Gaussian 09
title: 000008712
version: EM64L-G09RevD.01
frameworkgroup: C1[X(C7H8S)]
method: RPBEPBE
basis: SDD
operation: Freq
keyword: #p
keyword: freq=noraman
keyword: PBEPBE/SDD
title: #p freq=noraman PBEPBE/SDD
converged: YES YES NO NO
title: Mulliken charges:
elementType: S C C C C C C C H H H H H H H H
charge: -0.033901 0.495806 -0.323574 -0.397458 -0.810422 -0.203492 -0.231105 -0.237921 0.231068 0.243695 0.243225 0.226383 0.223550 0.228479 0.228958 0.116709
chargesum: 0.00000
title: Mulliken charges with hydrogens summed into heavy atoms:
elementType: S C C C C C C C
charge: 0.082809 0.495806 -0.323574 -0.166390 -0.097119 0.020058 -0.002626 -0.008963
polarizability: 1.20849943e+02 -1.41859732e+00 1.00190695e+02 1.15698117e-02 5.47389585e-03 3.97100556e+01
1716.lowfreq: -11.1722 -6.9770 -0.0018 0.0003 0.0023 11.8607 133.7024 148.9669 205.5463
frequency: 133.6874 148.9661 205.5413 227.8259 238.0567 355.3770 415.1043 432.3466 516.2231 539.4856 660.5440 713.1878 747.3669 783.3921 853.4333 887.1755 932.0604 978.0110 984.9958 1034.2039 1046.7115 1051.3649 1134.4284 1173.1464 1216.8513 1281.4829 1371.6350 1400.7088 1419.4428 1463.1462 1465.3107 1476.3828 1580.7685 1602.6163 2443.9569 2971.2032 3045.5723 3089.3755 3119.9102 3125.2540 3142.6481 3164.1939
redmass: 1.0499 3.6582 1.0889 4.3672 3.1986 4.2448 4.4738 2.8734 3.4874 5.6002 6.2767 3.3263 1.2347 3.7837 1.3059 1.1840 1.3603 1.3217 1.5998 3.6551 1.5325 2.5401 1.5080 1.0577 2.4042 1.4400 7.2800 1.2533 2.0079 2.5095 1.0491 1.1440 6.1233 6.4432 1.0381 1.0377 1.0972 1.0984 1.0863 1.0892 1.0934 1.1008
irintensity: 1.0673 1.0165 31.5588 2.1529 1.5256 0.1077 1.5037 9.7425 0.2921 1.0826 10.5608 3.6798 87.5461 7.4109 0.0552 13.8443 0.4590 0.0005 1.9309 42.6616 9.6232 11.7267 1.5143 0.0826 4.2619 1.1548 1.4998 17.5318 7.6973 32.4066 15.3934 27.2246 13.2878 7.6301 20.2105 20.5949 16.4609 18.8423 8.8796 4.3689 26.8737 24.7455
temp: 298.150 k
press: 1.00000 atm
elementType: 16 6 6 6 6 6 6 6 1 1 1 1 1 1 1 1
symmnumber: 1
zpe: 326419.6 jmol-1
zpe.correction: 0.124327 hartree
zpe.thermalcorrener: 0.132260 hartree
zpe.thermalcorrenthalpy: 0.133204 hartree
zpe.thermalcorrgfe: 0.091925 hartree
zpe.sumelectzpe: -669.015918 hartree
zpe.sumelectthermal: -669.007985 hartree
zpe.sumelectthermalent: -669.007041 hartree
zpe.sumelectthermalfe: -669.048320 hartree
dipole: -0.7348 -0.4992 0.0053
dipole: 0.8884
quadrupole: -53.1848 -46.0163 -60.2563
quadrupole: -1.7931 0.0060 -0.0027
quadrupole: -0.0324 7.1362 -7.1038 -1.7931 0.0060 -0.0027
hfenergy: -669.140245 hartree
pointgroup: C01 [X(C7H8S1)]
dipole: -0.3287202 -0.1186247 0.0049599 debye
dipolederiv: -0.4144132 0.3396789 0.012769 0.348387 0.0279995 -0.0014219 0.012963 -0.0019121 -0.1771825 -0.00788 0.2806042 0.0078205 0.3512515 -0.0095115 -0.00642 0.0109125 -0.0036709 0.0122903 0.7354861 -0.4522667 -0.0259868 -0.5923251 0.1166426 0.0163707 -0.0291159 0.0138695 -0.114708 0.0213338 -0.1098989 -0.0064013 -0.0116607 0.0807506 0.0069031 -0.0042882 0.0086204 -0.175501 -0.1235668 -0.1015944 0.0007111 -0.0864755 0.0252228 0.0001737 -0.0012887 -0.0010331 0.0586654 -0.3108858 0.1124445 0.0059226 0.0358721 0.0175227 0.0033912 0.0036353 0.0013199 -0.1389603 -0.0051979 -0.033865 -0.003743 -0.0747445 -0.0679818 0.0037399 -0.0048244 0.0029473 -0.1705277 0.052633 0.0172856 -0.0035493 0.0098127 0.0722626 0.0055648 -0.0033261 0.0056143 -0.1565566 0.075464 0.004177 0.0017159 0.0328655 -0.1286646 -0.0076509 0.002407 -0.0068081 0.1538639 0.0008431 -0.0408771 -0.0940312 0.0008541 0.0760484 0.0577723 -0.1089578 0.0170536 -0.0315323 0.0052036 -0.0417975 0.09146 -0.001276 0.0785595 -0.055648 0.1080211 -0.0133468 -0.0360401 0.0662652 0.1295911 0.0022195 0.0078089 -0.1361295 -0.0029175 0.0009465 -0.0050934 0.1104951 0.0630858 0.0655067 0.0032991 0.0258303 -0.1029438 -0.0069105 0.0022795 -0.0073753 0.1565621 -0.1048782 0.0710612 0.0066593 0.0788452 0.0539175 -0.0042121 0.0067711 -0.003994 0.1665067 -0.0632754 -0.0916114 0.001745 -0.1023745 0.0043535 -0.0021792 0.0015519 -0.0024495 0.1640207 0.0097828 -0.1484384 -0.0006104 -0.0226709 -0.1080483 -0.0065556 0.0023133 -0.0037421 0.1786043 unknown
polarizability: 118.8692203|-6.1745853|102.1019331|-1.5538314|1.6747924|39.77954 unknown
InChI: InChI=1S/C7H8S/c1-6-4-2-3-5-7(6)8/h2-5,8H,1H3
charge 0 multiplicity 1
16 atoms
S  2.335708 -1.26532 -0.099513
C  0.456602 0.808839 -0.014597
C  0.614882 -0.606099 -0.05284
C  -0.863306 1.324623 0.022409
C  1.658379 1.733133 -0.012379
C  -0.509377 -1.464683 -0.054158
C  -1.993576 0.476737 0.021624
C  -1.813351 -0.923855 -0.016925
H  -0.998084 2.412564 0.051995
H  2.302947 1.551854 0.869437
H  2.289892 1.57382 -0.907609
H  1.347116 2.790937 0.003418
H  -0.374951 -2.552704 -0.083372
H  -3.001592 0.903972 0.050361
H  -2.678271 -1.596186 -0.018384
H  1.98198 -2.60363 -0.124565
