program: Gaussian 09
title: 000008693
version: EM64L-G09RevD.01
frameworkgroup: C1[X(C13H17NO4)]
method: RPBEPBE
basis: SDD
operation: Freq
keyword: #p
keyword: freq=noraman
keyword: PBEPBE/SDD
title: #p freq=noraman PBEPBE/SDD
converged: YES YES NO NO
title: Mulliken charges:
elementType: O O O O N C C C C C C C C C C C C C H H H H H H H H H H H H H H H H H
charge: -0.279517 -0.230542 -0.248270 -0.249450 0.038915 -0.382747 -0.378952 -0.225796 -0.230911 0.257967 -0.677132 -0.051558 -0.679703 -0.273561 0.183458 -0.254105 0.213818 -0.468263 0.218089 0.218095 0.220340 0.220300 0.226743 0.226797 0.224918 0.224855 0.213765 0.228457 0.213743 0.212225 0.227016 0.212245 0.283157 0.282583 0.283023
chargesum: 0.00000
title: Mulliken charges with hydrogens summed into heavy atoms:
elementType: O O O O N C C C C C C C C C C C C C
charge: -0.279517 -0.230542 -0.248270 -0.249450 0.038915 0.053437 0.061687 0.227743 0.218862 0.257967 -0.021167 -0.051558 -0.028216 0.009596 0.183458 0.028477 0.213818 -0.185241
polarizability: 2.56593898e+02 -6.78684682e-01 1.64210365e+02 -4.47532716e-02 -2.25630958e-02 9.25119617e+01
1716.lowfreq: -13.1060 -9.4499 -4.9372 -1.7141 0.0004 0.0008 0.0012 27.8883 36.0018
frequency: -10.0179 27.2349 35.3996 40.3434 51.9243 56.3191 68.0708 77.5323 82.9985 149.6795 160.3168 182.0140 206.5037 211.2249 212.0695 212.8754 280.2412 305.3141 311.8200 340.4183 358.1950 391.6414 460.3707 478.2651 492.1194 532.5160 623.4882 673.3510 697.4624 705.4027 753.4715 754.5740 789.8119 800.7707 821.9820 875.6785 877.6603 879.5508 883.9585 895.1331 935.2435 936.5934 956.9973 995.9458 1019.0571 1048.4616 1049.7293 1078.1918 1094.4545 1122.9397 1136.3183 1136.5996 1141.4315 1143.6403 1227.9409 1229.7560 1242.5423 1262.9023 1280.4449 1280.5470 1281.8514 1308.6808 1308.8220 1324.5105 1362.5653 1374.0670 1375.4985 1395.5585 1396.7644 1456.6327 1468.4542 1469.9554 1476.5005 1477.0685 1478.7056 1479.5023 1488.9950 1489.3288 1544.4715 1585.5916 1594.5875 1614.8287 2979.7761 2981.6507 2997.3730 2999.2651 3006.2484 3008.0226 3045.4504 3046.0886 3064.5105 3067.9906 3084.8179 3086.6278 3087.0568 3087.2871 3160.2956 3164.5501 3182.0970
redmass: 2.6536 3.1093 2.0752 3.9796 3.4014 2.9117 5.5457 4.6460 3.9018 3.3348 4.4648 3.4918 6.0115 4.3654 1.1166 1.1161 6.5365 4.5316 4.3878 4.1864 5.8544 3.2029 4.5962 5.6452 5.9946 6.4964 8.6375 6.6669 8.1956 4.4652 1.0777 1.0789 9.5793 5.6829 9.2434 1.1570 1.1550 2.8103 2.7135 1.5065 2.7719 2.7584 1.4587 3.8919 1.3639 2.8933 2.9193 5.7642 4.8060 1.3738 2.2234 2.1948 1.4770 1.4849 1.2528 1.2473 2.7698 3.4260 1.0973 1.0985 1.6440 1.4197 1.4332 7.1897 2.3317 1.5231 1.7271 1.2204 1.2150 2.6569 1.0853 1.0783 1.0568 1.0579 1.0416 1.0412 1.0886 1.0893 6.7620 6.3042 11.3778 11.4525 1.0361 1.0361 1.0581 1.0598 1.0575 1.0592 1.1018 1.1019 1.1042 1.1044 1.0988 1.0990 1.1049 1.1052 1.0902 1.0926 1.0973
irintensity: 0.0510 0.1941 0.3103 0.4636 0.2045 0.1046 3.0399 0.1753 1.8906 0.0076 1.3318 10.8528 0.1053 5.6181 0.0259 0.0130 0.5979 19.3332 14.4730 11.5985 0.0659 2.3402 0.6828 5.0537 1.8959 0.7518 5.4192 6.1287 0.4120 40.8501 5.3560 5.7076 7.9116 0.0650 6.3826 2.3013 2.9582 9.9866 11.8438 26.1181 27.9502 46.1682 4.9395 64.7553 0.0006 23.1352 30.1876 200.6085 385.7485 39.3967 4.7198 0.7627 0.5121 0.5108 0.5916 0.5782 419.0595 218.7181 0.0038 0.0017 58.7318 35.5897 4.4801 0.5542 25.4523 5.2661 2.4332 12.1998 10.5432 0.7008 2.3497 2.7783 2.6732 2.5056 13.0260 13.6456 19.9662 17.6430 15.6935 28.5945 154.0916 201.8400 36.4832 33.5971 9.8837 0.8858 40.2040 29.9691 0.4016 2.6637 0.2747 0.3753 38.7136 37.8656 59.0823 117.3272 0.7569 4.0137 0.4110
temp: 298.150 k
press: 1.00000 atm
elementType: 8 8 8 8 7 6 6 6 6 6 6 6 6 6 6 6 6 6 1 1 1 1 1 1 1 1 1 1 1 1 1 1 1 1 1
symmnumber: 1
zpe: 734982.6 jmol-1
zpe.correction: 0.279940 hartree
zpe.thermalcorrener: 0.298503 hartree
zpe.thermalcorrenthalpy: 0.299447 hartree
zpe.thermalcorrgfe: 0.230124 hartree
zpe.sumelectzpe: -859.874823 hartree
zpe.sumelectthermal: -859.856260 hartree
zpe.sumelectthermalent: -859.855315 hartree
zpe.sumelectthermalfe: -859.924639 hartree
dipole: -1.2312 2.3090 0.0004
dipole: 2.6168
quadrupole: -84.5565 -109.6343 -105.0901
quadrupole: -2.4250 0.0168 0.0090
quadrupole: 15.2038 -9.8740 -5.3298 -2.4250 0.0168 0.0090
hfenergy: -860.1547629 hartree
pointgroup: C01 [X(C13H17N1O4)]
dipole: -0.4859689 0.9076081 0.0003809 debye
polarizability: 256.5958261|-0.5188207|164.2082865|-0.160364|-0.0302809|92.5121123 unknown
InChI: InChI=1S/C13H17NO4/c1-3-7-17-12(15)10-5-6-11(14-9-10)13(16)18-8-4-2/h5-6,9H,3-4,7-8H2,1-2H3
charge 0 multiplicity 1
35 atoms
O  -3.438611 0.47651 0.002865
O  3.426171 0.514928 -0.003831
O  -3.59585 -1.851074 0.006072
O  3.551147 -1.810492 -0.003885
N  0.704923 0.458911 -0.001917
C  -5.291957 2.049898 0.001243
C  5.303212 2.052867 -0.001619
C  -4.931641 0.564605 0.005151
C  4.921296 0.573195 -0.004452
C  -1.405291 -0.783376 0.001516
C  -6.823994 2.252963 0.003917
C  1.366406 -0.739837 -0.002098
C  6.83754 2.235646 -0.00261
C  -0.703037 -2.014687 0.001386
C  -2.89855 -0.806059 0.003528
C  0.703571 -1.994719 -0.000492
C  2.873414 -0.749062 -0.004139
C  -0.654466 0.42362 -0.000193
H  -4.846031 2.528894 -0.890242
H  -4.842193 2.534534 0.887739
H  4.858408 2.541674 -0.887954
H  4.860008 2.53785 0.887613
H  -5.309749 0.041716 0.903192
H  -5.31291 0.036209 -0.888307
H  5.293297 0.039112 0.889948
H  5.292289 0.042836 -0.901491
H  -7.289326 1.802571 0.900432
H  -7.073942 3.328307 0.000311
H  -7.293355 1.795645 -0.886979
H  7.300147 1.773088 0.889336
H  7.101907 3.307691 0.000113
H  7.298412 1.778052 -0.898004
H  -1.269141 -2.951344 0.002731
H  1.301637 -2.909747 -0.000765
H  -1.168343 1.389074 -0.000113
