program: Gaussian 09
title: 000008692
version: EM64L-G09RevD.01
frameworkgroup: C1[X(C10H13NO4)]
method: RPBEPBE
basis: SDD
operation: Freq
keyword: #p
keyword: freq=noraman
keyword: PBEPBE/SDD
title: #p freq=noraman PBEPBE/SDD
converged: YES YES NO NO
title: Mulliken charges:
elementType: O O O O N C C C C C C C C C C H H H H H H H H H H H H H
charge: -0.320764 -0.489641 -0.445173 -0.260198 -0.682071 -0.103325 -0.272384 -0.304688 0.233432 0.186878 -0.332869 -0.327172 0.501965 -0.403946 -0.399082 0.225953 0.224708 0.244053 0.192672 0.206967 0.266419 0.257131 0.224038 0.222271 0.366357 0.361315 0.313295 0.313860
chargesum: 0.00000
title: Mulliken charges with hydrogens summed into heavy atoms:
elementType: O O O O N C C C C C C C C C C
charge: -0.320764 -0.123284 -0.083858 -0.260198 -0.054916 0.122628 0.196376 0.094950 0.233432 0.186878 -0.066451 -0.070041 0.501965 -0.179908 -0.176811
polarizability: 2.15361820e+02 2.12114497e+01 1.33084731e+02 -6.44325587e+00 4.48713309e+00 7.10470112e+01
1716.lowfreq: -16.1767 -6.3900 -0.0009 -0.0003 0.0004 4.4716 20.1191 36.2574 51.5008
frequency: 18.7408 36.1908 51.4425 70.7440 97.8083 109.0232 149.5169 162.2407 221.7841 249.6253 289.7118 298.1856 360.2743 388.4048 389.7438 411.2684 419.5230 429.1125 454.5652 496.1712 506.3181 510.8591 528.5444 611.1731 633.9862 676.5843 754.8205 772.9817 820.5875 823.5559 834.6077 843.7720 907.6589 911.9148 969.9186 983.3930 987.0826 997.6768 1017.6340 1025.6653 1052.2576 1073.0729 1103.2926 1132.3911 1159.1892 1180.8208 1208.1659 1239.4956 1247.5059 1287.2962 1309.5873 1320.9114 1329.1488 1354.9496 1377.3214 1392.7012 1398.6218 1451.1767 1452.9773 1465.3982 1518.4431 1569.6902 1619.5752 1633.3741 1648.3569 2957.1065 2985.8900 3008.8465 3075.4884 3083.6928 3125.7850 3128.5463 3159.8880 3171.9924 3522.8625 3559.2612 3573.1125 3698.5864
redmass: 4.1954 4.3046 6.3477 5.1671 6.3127 3.1695 4.7012 4.0437 5.3065 5.1975 4.9105 3.5699 4.4440 1.4609 2.1834 1.5839 1.4608 1.2244 2.4236 1.3152 2.7375 3.1065 3.6899 5.9257 6.8958 4.0725 4.4324 6.3915 4.4198 1.2823 4.3174 1.8341 3.0886 2.0098 1.3653 1.3580 4.5288 3.3281 1.6420 2.2416 3.5112 1.9582 3.1317 1.2153 1.1901 1.1430 1.1302 1.2795 1.9794 1.4921 1.3164 1.2979 2.8795 1.3111 1.4047 4.6448 1.4132 3.8556 1.1166 1.0877 3.2056 7.1642 10.2074 3.1101 1.4744 1.0692 1.0833 1.0573 1.0997 1.1026 1.0895 1.0892 1.0955 1.0949 1.0650 1.0452 1.0658 1.1040
irintensity: 1.0544 0.2964 1.0708 6.0737 3.5398 2.5016 4.0250 4.3078 1.8033 11.0155 9.5161 7.3863 2.1989 122.5825 44.7763 4.4348 16.1305 298.4088 15.2864 135.2066 27.2478 43.9350 20.2328 6.2961 2.3477 26.7054 11.1481 26.5018 5.6606 2.8129 42.8206 68.9748 12.6946 6.5666 0.5062 1.0903 136.3167 29.2945 66.1314 210.6781 196.0048 21.1202 21.4816 14.1242 5.5289 194.0351 1.3019 145.6549 195.6841 57.9752 2.5364 24.9566 104.7528 2.7906 49.9225 10.6172 15.1630 6.6269 4.4460 7.0990 67.2561 25.6953 470.6930 59.7000 291.3222 42.2836 51.1339 27.2262 3.6400 51.1922 13.3663 19.6731 9.3325 4.4419 14.9414 118.6032 13.0463 24.7247
temp: 298.150 k
press: 1.00000 atm
elementType: 8 8 8 8 7 6 6 6 6 6 6 6 6 6 6 1 1 1 1 1 1 1 1 1 1 1 1 1
symmnumber: 1
zpe: 578990.1 jmol-1
zpe.correction: 0.220526 hartree
zpe.thermalcorrener: 0.235832 hartree
zpe.thermalcorrenthalpy: 0.236776 hartree
zpe.thermalcorrgfe: 0.176175 hartree
zpe.sumelectzpe: -743.378013 hartree
zpe.sumelectthermal: -743.362707 hartree
zpe.sumelectthermalent: -743.361763 hartree
zpe.sumelectthermalfe: -743.422363 hartree
dipole: -7.1750 -2.2343 -0.2349
dipole: 7.5185
quadrupole: -75.3801 -87.1616 -91.1906
quadrupole: 15.1472 -0.6344 -0.4944
quadrupole: 9.1973 -2.5841 -6.6132 15.1472 -0.6344 -0.4944
hfenergy: -743.5985386 hartree
pointgroup: C01 [X(C10H13N1O4)]
dipole: -2.8129374 -0.9114405 -0.0802154 debye
polarizability: 215.2522089|21.3909338|133.8053926|-4.9364498|-0.5411165|70.4359604 unknown
InChI: InChI=1S/C10H13NO4/c11-8-3-1-7(2-4-8)10(14)15-6-9(13)5-12/h1-4,9,12-13H,5-6,11H2
charge 0 multiplicity 1
28 atoms
O  1.109087 0.232705 -0.185336
O  3.255029 -1.022627 1.183136
O  5.77446 -1.05872 0.115498
O  0.232902 2.393555 -0.089591
N  -5.127765 -1.305503 -0.004284
C  3.435487 -0.335109 -0.112408
C  2.467597 0.838817 -0.235751
C  4.910171 0.097453 -0.110393
C  -1.278574 0.478283 -0.090778
C  0.033685 1.15241 -0.118601
C  -2.446952 1.278415 0.048315
C  -1.42562 -0.931992 -0.204001
C  -3.868088 -0.721499 -0.03287
C  -3.720196 0.695785 0.079593
C  -2.69551 -1.525754 -0.177297
H  3.260467 -1.054884 -0.939082
H  2.590695 1.381891 -1.191096
H  2.576026 1.552313 0.600634
H  5.063419 0.870404 0.67344
H  5.19955 0.510034 -1.091361
H  -2.327166 2.363905 0.130823
H  -0.533554 -1.553579 -0.322572
H  -4.610543 1.326245 0.189963
H  -2.794421 -2.614039 -0.269609
H  2.296692 -1.253286 1.280279
H  5.387305 -1.547149 0.889831
H  -5.2393 -2.312475 -0.084024
H  -5.964381 -0.737198 0.09554
