program: Gaussian 09
title: 000109401
version: EM64L-G09RevD.01
frameworkgroup: C1[X(C16H31NO)]
method: RPBEPBE
basis: SDD
operation: Freq
keyword: #p
keyword: freq=noraman
keyword: PBEPBE/SDD
title: #p freq=noraman PBEPBE/SDD
converged: YES YES NO NO
title: Mulliken charges:
elementType: O N C C C C C C C C C C C C C C C C H H H H H H H H H H H H H H H H H H H H H H H H H H H H H H H
charge: -0.292351 -0.028140 -0.000915 -0.426455 -0.446395 0.060064 -0.488757 0.053583 -0.412250 -0.412911 -0.750914 -0.420924 -0.703664 -0.721740 -0.698352 -0.214787 -0.448178 -0.115377 0.231970 0.183252 0.190858 0.187138 0.188397 0.197945 0.185779 0.238136 0.187882 0.188119 0.201322 0.201308 0.184801 0.222111 0.203980 0.202973 0.210467 0.199936 0.207778 0.207021 0.212837 0.201255 0.204704 0.258447 0.231113 0.227873 0.210942 0.202644 0.196816 0.261273 0.239388
chargesum: 0.00000
title: Mulliken charges with hydrogens summed into heavy atoms:
elementType: O N C C C C C C C C C C C C C C C C
charge: -0.292351 -0.028140 0.231055 -0.052345 -0.070861 0.258009 -0.064843 0.241465 -0.022809 -0.026802 -0.121850 -0.010520 -0.076028 -0.057334 -0.028424 0.184673 0.052482 -0.115377
polarizability: 1.94957882e+02 2.16493409e+00 1.71899044e+02 -9.34673619e+00 3.72646233e+00 1.67429125e+02
1716.lowfreq: -13.1139 -8.3474 -0.0006 -0.0003 0.0002 6.9319 15.4162 25.6937 29.2671
frequency: 13.0117 24.7722 29.1507 35.3195 54.5355 66.9912 72.6138 78.7966 81.5067 98.6359 114.3444 161.9065 169.9913 191.5244 195.5528 204.7221 214.3587 221.0232 224.1549 250.1086 258.0449 284.7436 288.3497 310.5439 342.3366 358.8275 372.0157 387.4353 419.5534 434.0576 445.9734 496.0329 531.8398 565.8391 587.9029 717.2894 742.1219 761.9988 766.1831 783.2859 827.2302 832.4114 861.0810 870.6495 879.5263 888.2411 910.9198 937.0798 946.5228 964.6374 992.0230 1008.6344 1015.7565 1030.1939 1035.6415 1043.1034 1047.7149 1054.6614 1065.3069 1069.1493 1081.8815 1091.9082 1116.5641 1142.5914 1152.9876 1155.9784 1166.0153 1187.3244 1196.5562 1222.8497 1234.3404 1245.1292 1247.7738 1261.1175 1267.5907 1277.0946 1291.7899 1299.6715 1306.8743 1315.9082 1322.9928 1327.5795 1334.6300 1345.4995 1346.5986 1353.3870 1359.9189 1364.5547 1378.1261 1384.3966 1388.3599 1390.5551 1398.5904 1434.7345 1444.3394 1458.4497 1462.8522 1467.1225 1468.3354 1469.5125 1474.9758 1476.2557 1476.3913 1479.7040 1482.9041 1483.1454 1485.1622 1492.5344 1492.8160 2205.9386 2921.1565 2936.3174 2945.9669 2953.3166 2957.0336 2962.2765 2964.6510 2970.7739 2971.1164 2973.6957 2974.3724 2981.6336 2986.9248 2987.6205 2993.8271 3007.1006 3009.7702 3014.6341 3018.5141 3021.0312 3025.8624 3049.6887 3056.6717 3063.0739 3065.6642 3066.2183 3066.5361 3066.7434 3074.8596 3080.9565 3085.4377
redmass: 3.8182 3.3331 3.5865 4.6000 3.6851 3.1462 2.1276 3.2072 2.3015 3.7025 2.2466 2.0248 2.5175 1.3998 1.5050 1.6196 1.7960 1.6130 1.7125 2.3553 2.0360 2.1246 2.0763 2.7338 2.3538 2.3580 3.2406 2.2085 2.6746 2.4203 2.5218 2.6560 2.7549 3.4966 2.8028 1.7694 2.0858 1.4322 1.2105 1.3308 1.8463 2.8875 2.0416 2.1789 2.0223 1.6380 1.9001 2.2928 1.6816 1.4657 1.6599 1.3495 2.2566 1.8092 1.6650 2.3270 2.5185 2.2758 1.9572 2.5802 1.9784 2.2678 2.0643 2.1356 2.0566 2.1878 2.1393 1.1540 1.2983 1.3886 1.2124 1.2431 1.2831 1.2671 1.2732 1.2778 1.2753 1.2352 1.2646 1.2058 1.3700 1.4120 1.3264 1.4104 1.4922 1.4677 1.4647 1.4498 1.3624 1.2110 1.2072 1.2269 1.2013 1.0895 1.0835 1.0718 1.0770 1.0736 1.0756 1.0746 1.0506 1.0630 1.0450 1.0523 1.0444 1.0728 1.0571 1.0575 1.0558 12.4367 1.0817 1.0549 1.0627 1.0626 1.0645 1.0565 1.0458 1.0521 1.0480 1.0381 1.0615 1.0758 1.0442 1.0930 1.0853 1.0929 1.0643 1.0966 1.0995 1.0969 1.0964 1.0963 1.0979 1.0990 1.0993 1.0986 1.0995 1.1005 1.1004 1.0997 1.1000
irintensity: 0.1998 2.0947 2.3830 1.3908 3.1914 0.4738 0.8991 0.5728 0.9555 1.6824 0.2511 1.6579 4.0416 0.1518 0.4884 0.0524 0.9363 4.8107 0.3768 1.9489 0.0574 0.7717 0.5102 2.9576 0.9770 0.3406 0.4977 1.5432 0.5262 0.2440 0.7120 2.2032 1.2798 1.8256 3.8781 2.5411 2.9404 10.8797 5.8331 5.9139 2.3405 1.4422 2.8983 7.5570 7.0728 6.8253 1.4613 44.5242 6.0808 8.7974 2.2053 6.4153 30.5709 3.6026 4.3575 1.5570 51.4991 0.2073 4.5517 21.5884 3.3865 20.4364 9.7399 4.3789 8.5221 1.0624 2.6270 3.0272 0.6661 1.4283 6.3577 2.3160 0.8452 0.4501 3.6439 0.2382 1.3622 0.4774 26.4325 4.5110 2.8069 1.7948 8.3940 0.9122 2.6657 0.3149 0.5821 6.9950 3.5192 14.6828 7.7179 25.7985 14.0137 20.1206 4.0095 3.0006 1.6637 4.9230 7.3388 2.4809 3.3153 8.4883 17.5416 6.2339 0.8583 14.5013 30.8184 14.6743 10.9550 8.7713 34.6103 65.4551 22.7234 20.3497 25.0951 41.0460 50.0334 28.8107 43.2725 43.3590 49.0681 53.8308 6.2697 48.2025 2.4754 23.0407 19.4904 35.0330 28.1400 31.4394 75.8048 38.5139 55.9859 53.3860 66.1097 53.7952 50.0597 34.5486 40.8405 47.2605 40.0686
temp: 298.150 k
press: 1.00000 atm
elementType: 8 7 6 6 6 6 6 6 6 6 6 6 6 6 6 6 6 6 1 1 1 1 1 1 1 1 1 1 1 1 1 1 1 1 1 1 1 1 1 1 1 1 1 1 1 1 1 1 1
symmnumber: 1
zpe: 1152025.6 jmol-1
zpe.correction: 0.438783 hartree
zpe.thermalcorrener: 0.462208 hartree
zpe.thermalcorrenthalpy: 0.463152 hartree
zpe.thermalcorrgfe: 0.383413 hartree
zpe.sumelectzpe: -756.762429 hartree
zpe.sumelectthermal: -756.739004 hartree
zpe.sumelectthermalent: -756.738060 hartree
zpe.sumelectthermalfe: -756.817799 hartree
dipole: -4.5963 0.1843 1.0692
dipole: 4.7226
quadrupole: -109.7435 -110.1849 -119.4337
quadrupole: -9.9635 4.2451 4.9658
quadrupole: 3.3772 2.9358 -6.3130 -9.9635 4.2451 4.9658
hfenergy: -757.201212 hartree
pointgroup: C01 [X(C16H31N1O1)]
dipole: -1.5173989 0.9689029 -0.4593199 debye
polarizability: 183.0075829|-15.2351948|178.5085444|8.0928956|-0.5021294|172.7699243 unknown
InChI: InChI=1S/C16H31NO/c1-5-15(6-2)10-9-14(4)13-16(7-3)18-12-8-11-17/h14-16H,5-10,12-13H2,1-4H3
charge 0 multiplicity 1
49 atoms
O  -1.670535 0.379579 -0.618789
N  -0.602913 -3.173071 -0.302421
C  0.171659 0.758311 1.777681
C  1.696827 1.038899 1.893678
C  2.506828 0.994186 0.570723
C  2.504722 -0.366919 -0.184598
C  -0.554298 1.840479 0.933283
C  -1.941081 1.406599 0.424951
C  3.022423 -0.188503 -1.640435
C  3.33685 -1.433798 0.583622
C  -0.443137 0.646649 3.194465
C  -2.805519 2.562832 -0.134122
C  2.035146 0.541943 -2.579503
C  3.09949 -2.888353 0.116145
C  -2.159666 3.323237 -1.312349
C  -2.809719 -0.465196 -0.953224
C  -2.253629 -1.663196 -1.751253
C  -1.34541 -2.502732 -0.951442
H  0.032357 -0.211797 1.261004
H  1.836394 2.038305 2.360075
H  2.126543 0.309936 2.610407
H  2.13661 1.787679 -0.107673
H  3.56106 1.262023 0.798054
H  1.459949 -0.735733 -0.251165
H  -0.666031 2.766683 1.534651
H  0.053696 2.099758 0.04745
H  -2.507143 0.910516 1.24715
H  3.988935 0.358716 -1.61469
H  3.24135 -1.184982 -2.071032
H  3.0966 -1.373574 1.663724
H  4.414328 -1.177676 0.491967
H  0.019377 -0.18339 3.760004
H  -1.532886 0.458181 3.165153
H  -0.276738 1.579911 3.768272
H  -3.017419 3.262582 0.699418
H  -3.789038 2.159263 -0.450117
H  2.428913 0.59201 -3.611908
H  1.838357 1.578633 -2.248816
H  1.06207 0.015498 -2.60657
H  3.391927 -3.034542 -0.940258
H  3.691367 -3.599912 0.722243
H  2.032603 -3.163467 0.209103
H  -1.853555 2.618854 -2.106563
H  -1.260426 3.878786 -0.992035
H  -2.867642 4.051803 -1.746887
H  -3.545523 0.072581 -1.588676
H  -3.327394 -0.812899 -0.033031
H  -1.698804 -1.277581 -2.626834
H  -3.088077 -2.284707 -2.127432
