program: Gaussian 09
title: 000008658
version: EM64L-G09RevD.01
frameworkgroup: C1[X(C8H8O2)]
method: RPBEPBE
basis: SDD
operation: Freq
keyword: #p
keyword: freq=noraman
keyword: PBEPBE/SDD
title: #p freq=noraman PBEPBE/SDD
converged: NO NO NO NO
title: Mulliken charges:
elementType: O O C C C C C C C C H H H H H H H H
charge: -0.273127 -0.222164 0.237640 0.222996 -0.343599 -0.325770 -0.214787 -0.243459 -0.201652 -0.535240 0.244299 0.275637 0.230117 0.235645 0.211074 0.225959 0.225957 0.250473
chargesum: 0.00000
title: Mulliken charges with hydrogens summed into heavy atoms:
elementType: O O C C C C C C C C
charge: -0.273127 -0.222164 0.237640 0.222996 -0.099300 -0.050133 0.015330 -0.007814 0.009422 0.167149
polarizability: 1.19184585e+02 -2.97552373e+00 1.15980746e+02 1.56587875e-03 2.07305194e-03 4.17259744e+01
1716.lowfreq: -10.9835 -6.6187 -0.0002 0.0003 0.0006 7.3060 90.8057 122.2418 166.1420
frequency: 90.7034 122.2385 166.1375 178.7727 227.9315 252.5024 280.3216 382.3362 451.3898 463.9763 527.5112 569.0641 632.6694 730.5142 761.3558 767.6632 822.6305 863.6742 960.4085 987.3057 991.7874 1006.6138 1039.3336 1097.2086 1114.2616 1153.9521 1174.1510 1199.4454 1230.5208 1280.5654 1359.1797 1398.9393 1432.6721 1447.4175 1467.2270 1470.3206 1480.5344 1574.5696 1591.8571 1616.7200 2957.5009 2963.3820 3053.3026 3127.5881 3132.5687 3143.8097 3161.7331 3172.2086
redmass: 3.4682 4.0881 2.6764 5.3119 1.2883 3.9041 2.4461 5.7083 2.9842 6.7760 3.3757 5.5523 5.8016 3.0499 5.6083 1.3497 5.0101 1.3820 1.3773 1.4730 8.6857 1.5747 2.0748 2.3000 1.2586 1.3796 1.1111 1.8161 3.5365 1.6280 1.9229 2.8280 1.5438 1.6647 1.4158 1.0494 1.4933 7.4942 6.0944 6.2767 1.0868 1.0333 1.1042 1.0994 1.0863 1.0901 1.0938 1.0995
irintensity: 3.1401 1.7337 17.4720 0.4627 2.5625 8.3117 1.1140 2.8692 6.9147 11.0746 2.4170 5.8497 16.4572 1.5162 6.5683 96.5628 26.7380 0.2474 0.9457 1.7515 35.9862 4.1630 9.4084 25.0292 0.1271 4.2939 17.2888 30.0568 164.4768 59.5849 1.9585 64.3366 49.6579 3.8585 105.2245 14.7688 7.9999 77.6216 157.0263 85.8950 63.9034 57.8505 43.3698 19.9562 2.7107 1.7655 18.2434 17.5718
temp: 298.150 k
press: 1.00000 atm
elementType: 8 8 6 6 6 6 6 6 6 6 1 1 1 1 1 1 1 1
symmnumber: 1
zpe: 365330.4 jmol-1
zpe.correction: 0.139147 hartree
zpe.thermalcorrener: 0.148236 hartree
zpe.thermalcorrenthalpy: 0.149181 hartree
zpe.thermalcorrgfe: 0.104924 hartree
zpe.sumelectzpe: -459.346636 hartree
zpe.sumelectthermal: -459.337547 hartree
zpe.sumelectthermalent: -459.336602 hartree
zpe.sumelectthermalfe: -459.380859 hartree
dipole: -5.1467 2.6022 0.0007
dipole: 5.7671
quadrupole: -55.5359 -56.1481 -60.9195
quadrupole: 8.9962 -0.0052 0.0000
quadrupole: 1.9986 1.3864 -3.3850 8.9962 -0.0052 0.0000
hfenergy: -459.4857829 hartree
pointgroup: C01[X(C8H8O2)]
dipole: -2.212218 0.5042486 -0.0002913 debye
dipolederiv: -0.8595734 -0.5252178 -0.0000359 -0.880534 -1.0715744 -0.0001157 -0.0000623 -0.0001614 -0.290818 -1.1445006 0.4166831 0.0001678 0.1027207 -0.4835284 0.0000974 -0.0007643 0.0003216 -0.3442536 0.4389931 0.1758963 0.0000752 0.8814533 1.1084492 0.0001596 0.0002518 -0.0000158 0.103256 -0.4657976 0.0230011 -0.0001015 0.5214608 -0.7266082 0.0002925 -0.0000133 0.0001216 -0.0286478 0.0623057 0.1260653 0.0000325 -0.282539 -0.4854941 -0.0000712 -0.0000408 -0.0000206 -0.2087234 0.0677533 0.0834286 -0.0000319 -0.2954692 0.2462902 -0.0000376 0.0001558 -0.0001305 -0.0920385 0.3226507 -0.0402865 0.0000771 0.1573482 0.1623444 0.0000544 0.0000724 -0.0000016 -0.1153955 -0.4106884 0.1674094 -0.0000249 0.1827943 -0.0098269 0.0000527 -0.0000244 0.0000588 -0.1929524 1.27584 -0.4736524 -0.0001151 -0.5745442 1.0285602 -0.0006537 0.0004209 -0.0006704 0.1180375 0.787564 0.3632856 0.000024 0.1313466 0.2972811 0.0000015 -0.0000472 -0.0000284 0.3236137 -0.096499 -0.0245627 -0.0000423 -0.0380333 0.0932212 -0.0000073 -0.0000228 0.0000292 0.1706439 -0.0092081 -0.0497996 -0.0000051 0.0014131 0.1138774 0.0000105 -0.0000143 -0.0000168 0.1519493 0.0195223 0.103099 -0.000013 0.0924055 -0.0458436 0.0000135 0.0000071 -0.0000059 0.1529338 0.0556646 -0.0707334 -0.0000237 -0.0606138 -0.0928156 -0.000004 -0.0000701 -0.0000043 0.1711599 0.028308 -0.1326471 0.0000854 -0.0418662 -0.1516169 0.0002326 0.000175 0.0004858 0.1179307 -0.0696631 -0.0599063 -0.055857 0.0937344 0.069301 0.1061681 -0.097721 0.0530713 -0.0817258 -0.0695816 -0.0598992 0.055791 0.0937342 0.0692406 -0.1062416 0.0976829 -0.05309 -0.0817164 0.0669101 -0.0221633 -0.0000027 -0.0848114 -0.1212572 0.0000482 0.0000145 0.0000574 0.1267466 unknown
polarizability: 120.3927451|-1.8770484|114.7725813|0.0187615|-0.0059088|41.7259792 unknown
InChI: InChI=1S/C8H8O2/c1-10-8-5-3-2-4-7(8)6-9/h2-6H,1H3
charge 0 multiplicity 1
18 atoms
O  -1.174069 -1.592567 -0.000583
O  2.889576 -1.216884 0.001192
C  -0.697614 -0.279332 -0.000445
C  0.725451 -0.125236 -0.000251
C  -1.537894 0.862465 -0.000513
C  1.273935 1.183688 -0.00013
C  -0.961136 2.151658 -0.000383
C  0.44482 2.32131 -0.000204
C  1.627776 -1.304891 -0.000169
C  -2.621421 -1.806126 -0.000235
H  -2.6269 0.759167 -0.00065
H  2.366666 1.268352 -0.000002
H  -1.618339 3.028879 -0.000434
H  0.879369 3.325803 -0.000118
H  1.122889 -2.296192 0.001675
H  -3.091917 -1.375802 -0.905445
H  -3.091556 -1.375437 0.904991
H  -2.750535 -2.898253 0.000004
