program: Gaussian 09
title: 000108978
version: EM64L-G09RevD.01
frameworkgroup: C1[X(C8H8Cl3NS)]
method: RPBEPBE
basis: SDD
operation: Freq
keyword: #p
keyword: freq=noraman
keyword: PBEPBE/SDD
title: #p freq=noraman PBEPBE/SDD
converged: YES YES NO NO
title: Mulliken charges:
elementType: Cl Cl Cl S N C C C C C C C C H H H H H H H H
charge: 0.020880 0.000534 0.028690 0.277956 0.078453 -0.335373 -0.612613 0.054842 -0.668278 -0.028701 -0.099079 -0.287966 -0.342234 0.218980 0.223053 0.267805 0.266159 0.215103 0.227924 0.213545 0.280320
chargesum: 0.00000
title: Mulliken charges with hydrogens summed into heavy atoms:
elementType: Cl Cl Cl S N C C C C C C C C
charge: 0.020880 0.000534 0.028690 0.277956 0.078453 0.106659 -0.078649 0.054842 -0.011705 -0.028701 -0.099079 -0.287966 -0.061914
polarizability: 1.82959214e+02 4.70243328e+00 1.68467558e+02 -1.09764532e+01 3.79681377e+00 7.98464021e+01
1716.lowfreq: -6.7756 -4.6698 -0.0026 -0.0018 0.0020 4.6489 22.2729 33.9354 41.7253
frequency: 21.7578 33.8273 41.6836 81.3414 90.6338 110.8013 182.3225 188.9664 202.3385 222.5556 225.5835 259.7873 309.6372 314.8911 331.3864 358.0787 459.0968 468.4109 526.1382 546.9750 578.6222 675.7483 713.9664 739.0834 753.7177 790.0876 859.8234 893.8045 900.2546 1003.0805 1044.5753 1045.8598 1103.7166 1127.6364 1182.8411 1215.8582 1245.9050 1279.1049 1288.3306 1304.9177 1333.0798 1375.6871 1391.6236 1454.2975 1476.5887 1477.2185 1486.7602 1494.6615 1499.3477 2980.8594 2993.4768 3034.6139 3043.1122 3079.9304 3083.5871 3119.0246 3170.6554
redmass: 2.1375 3.4558 6.9644 11.7439 3.6778 3.8506 11.2277 8.6606 26.0956 2.3415 1.5737 7.7406 7.6577 28.5433 4.4212 14.0308 8.5528 14.8813 5.1532 12.3469 10.3318 5.7167 10.2181 8.2861 1.0822 11.3577 1.1782 1.4220 1.8956 11.3306 2.5074 1.2397 2.2131 8.3827 2.4062 1.4227 1.2071 5.4786 1.2297 11.5633 1.4116 1.9101 1.2004 1.0902 1.0480 1.0420 1.0855 8.6158 9.2838 1.0354 1.0599 1.0568 1.1013 1.1017 1.0994 1.1095 1.0935
irintensity: 0.2302 0.7477 0.1186 0.0909 0.8763 0.7187 0.5414 0.5210 0.1617 0.1837 0.0856 1.8749 1.4784 0.3570 0.3213 2.0737 4.7467 4.5276 7.9769 43.9908 1.6128 21.0965 24.4744 3.2895 8.1833 49.6707 0.6676 14.0894 12.5583 25.0018 7.5640 1.5533 18.0835 13.6552 128.9694 0.7874 10.0519 79.2293 5.9040 2.1715 7.3591 129.2914 12.3644 6.7986 4.4721 14.3621 12.9276 32.2945 15.4985 32.7182 17.7879 16.3775 3.3494 41.9956 39.6150 19.5311 3.2603
temp: 298.150 k
press: 1.00000 atm
elementType: 17 17 17 16 7 6 6 6 6 6 6 6 6 1 1 1 1 1 1 1 1
symmnumber: 1
zpe: 372144.3 jmol-1
zpe.correction: 0.141742 hartree
zpe.thermalcorrener: 0.156253 hartree
zpe.thermalcorrenthalpy: 0.157197 hartree
zpe.thermalcorrgfe: 0.096993 hartree
zpe.sumelectzpe: -2141.650552 hartree
zpe.sumelectthermal: -2141.636042 hartree
zpe.sumelectthermalent: -2141.635097 hartree
zpe.sumelectthermalfe: -2141.695302 hartree
dipole: 3.3322 -0.0951 1.0082
dipole: 3.4827
quadrupole: -104.7516 -103.8292 -105.8532
quadrupole: -7.0324 3.9960 0.6064
quadrupole: 0.0597 0.9821 -1.0419 -7.0324 3.9960 0.6064
hfenergy: -2141.7922947 hartree
pointgroup: C01 [X(C8H8Cl3N1S1)]
dipole: -1.3241705 0.1725876 -0.3069134 debye
dipolederiv: -0.1621825 -0.2701874 0.0396363 -0.2108779 -0.6201197 0.0854532 0.025934 0.0820377 -0.0228597 -0.1627901 0.2906662 0.0821058 0.228372 -0.6624029 -0.1547178 0.0672531 -0.1564272 -0.0656962 -0.3636562 0.3610946 0.1270021 0.4201507 -0.5820183 -0.1786578 0.1518891 -0.1927242 -0.1072142 -0.4019828 -0.0763612 -0.0689747 -0.2378731 -0.0599093 0.0735185 -0.0351883 0.027322 0.0215753 -0.4495878 -0.2100604 0.0733187 0.2603746 -0.5833594 -0.1197905 0.1487733 0.0388159 -0.1970801 0.065667 -0.0107277 -0.0062342 -0.1312795 0.1111815 -0.0621898 -0.3037272 -0.0807794 0.0253851 0.2626796 0.0982339 0.2118861 0.3322464 0.1554435 0.0146755 0.3901193 0.0387897 0.1719271 0.5977519 0.1083458 -0.1050465 -0.0070702 -0.2294886 -0.062469 -0.2371864 -0.0924959 -0.0837217 -0.1235639 -0.0525736 -0.0721872 0.0173506 0.0882657 -0.0191162 0.079774 -0.0089411 0.0671146 -0.1978414 0.5893029 0.0406869 0.4066422 0.6936981 -0.1868714 0.1759443 -0.2076426 -0.0303486 -0.1314905 -0.6134991 -0.0894948 -0.2808437 0.8546767 0.2202573 -0.0756484 0.3025408 0.0507036 0.6362108 -0.5227638 -0.2378483 -0.7340101 0.9265396 0.341677 -0.2911488 0.2987711 0.1367781 0.2242867 0.3089478 -0.0444577 -0.017843 0.0906829 -0.0011602 -0.1179693 -0.1069088 0.0059072 0.0607808 -0.0092974 -0.0068999 -0.0201959 0.0295638 0.0956444 0.046945 0.0852634 -0.1047263 0.0504402 0.0161397 -0.0108558 0.0722825 -0.1203507 -0.0587787 0.0230275 -0.0446463 0.0644306 0.0559978 0.0318593 -0.0224728 0.0021241 -0.0616983 -0.0684106 -0.0245565 -0.0485635 0.0129557 -0.0164964 -0.0405585 -0.0025581 -0.0668359 0.0163981 0.0493336 -0.0465453 0.0387678 -0.0986262 0.091851 0.0923352 0.0106358 0.0305496 -0.1380293 -0.0609289 -0.0200265 -0.0344003 0.0644292 -0.2233263 -0.0192242 0.0162273 -0.0168741 0.0980679 -0.0191711 0.0166681 -0.0188244 0.0660534 0.1038896 -0.0356298 0.0511435 -0.020033 0.0143228 0.1175662 -0.0089232 0.0835018 -0.1088868 0.0833625 -0.0360424 0.0143874 -0.0263564 -0.0214644 -0.0058635 0.0345921 -0.0034566 0.1318999 unknown
polarizability: 180.5103459|-2.8361638|166.8043158|-16.9224498|15.8009424|83.9585123 unknown
InChI: InChI=1S/C8H8Cl3NS/c1-2-3-13-7-5(9)4-12-8(11)6(7)10/h4H,2-3H2,1H3
charge 0 multiplicity 1
21 atoms
Cl 0.248072 -2.362677 0.303969
Cl 0.054241 3.251752 0.740347
Cl 3.228225 -2.006315 -0.929577
S  -1.494701 0.36767 1.137014
N  2.855326 0.635724 -0.559727
C  -3.97788 -0.309937 0.034344
C  -2.48417 -0.37244 -0.32823
C  0.193424 0.443708 0.441839
C  -4.846587 -0.892093 -1.104888
C  0.943168 -0.710723 0.0779
C  0.860999 1.693627 0.301112
C  2.257771 -0.55624 -0.429882
C  2.179871 1.756285 -0.191631
H  -4.15849 -0.878212 0.967135
H  -4.270987 0.73876 0.23126
H  -2.146828 -1.408678 -0.48704
H  -2.25467 0.240834 -1.215138
H  -4.593317 -1.950098 -1.301836
H  -5.91755 -0.844323 -0.838567
H  -4.706225 -0.327137 -2.044904
H  2.699007 2.712113 -0.3022
