program: Gaussian 09
title: 000008635
version: EM64L-G09RevD.01
frameworkgroup: C1[X(C8H9NO2)]
method: RPBEPBE
basis: SDD
operation: Freq
keyword: #pfreq=noraman
keyword: PBEPBE/SDD
title: #p freq=noraman PBEPBE/SDD
converged: YES YES NO NO
title: Mulliken charges:
elementType: O O N C C C C C C C C H H H H H H H H H
charge: -0.289353 -0.322302 -0.683715 0.090627 0.325575 -0.309839 -0.391998 -0.265411 -0.194849 0.214998 -0.498913 0.267650 0.218443 0.229024 0.224446 0.374134 0.300591 0.240143 0.240247 0.230502
chargesum: 0.00000
title: Mulliken charges with hydrogens summed into heavy atoms:
elementType: O O N C C C C C C C C
charge: -0.289353 -0.322302 -0.008991 0.090627 0.325575 -0.042189 -0.173555 -0.036387 0.029597 0.214998 0.211979
polarizability: 1.44972579e+02 1.67155468e+00 1.18545147e+02 -2.04756626e-02 5.68883709e-03 4.60828513e+01
1716.lowfreq: -6.0948 -0.0007 -0.0006 0.0003 9.9800 14.7730 73.9587 86.7896 124.4656
frequency: 73.9400 86.7806 124.4618 164.3163 169.4345 248.4528 322.9333 336.8400 408.1261 427.1844 468.1844 482.2794 525.2658 552.1214 652.1195 678.0398 722.9968 756.0158 759.0579 778.8893 830.3310 854.6086 924.1933 962.9805 984.0504 1020.5854 1049.8057 1066.0222 1113.5955 1146.7930 1154.1780 1175.5169 1268.1971 1288.4073 1331.4806 1400.7957 1426.1855 1447.3364 1450.4280 1464.2506 1487.6168 1540.4460 1580.0550 1619.8669 1636.1976 3002.3601 3103.4099 3118.9824 3140.3426 3144.0189 3157.5364 3178.5053 3407.5633 3649.3367
redmass: 2.5294 1.4078 3.7669 4.1919 3.6953 4.2462 4.2366 5.4719 6.4383 2.6500 1.2644 3.6861 3.0948 6.7987 6.3716 4.5425 1.2356 5.6449 1.7195 2.0069 5.6750 1.5175 7.5178 1.3618 1.3247 2.2537 2.3817 2.7475 1.2600 1.4424 1.3232 1.0570 3.5407 1.9120 1.9563 4.3305 1.4317 2.5647 1.0505 1.0570 2.5673 3.4408 7.0789 1.5277 6.8932 1.0294 1.1044 1.0865 1.0917 1.1047 1.0931 1.0981 1.0556 1.0949
irintensity: 2.0241 2.7267 2.0319 4.9336 2.1029 1.3540 2.8141 23.5076 1.6126 26.8658 112.7129 10.8250 25.3147 1.1176 7.3291 17.5264 104.7965 7.1395 124.5159 1.5417 6.9942 1.7182 0.8150 2.1917 0.0004 8.0035 47.9600 164.9087 0.0905 64.0877 21.3566 19.4018 356.4110 13.8395 11.5357 28.4714 27.7757 0.1170 13.3863 15.1490 38.9991 237.6081 101.1331 103.6423 213.8726 46.2037 29.2574 8.2842 21.5612 18.0384 15.8627 12.4149 109.5710 52.7886
temp: 298.150 k
press: 1.00000 atm
elementType: 8 8 7 6 6 6 6 6 6 6 6 1 1 1 1 1 1 1 1 1
symmnumber: 1
zpe: 411894.7 jmol-1
zpe.correction: 0.156882 hartree
zpe.thermalcorrener: 0.167054 hartree
zpe.thermalcorrenthalpy: 0.167999 hartree
zpe.thermalcorrgfe: 0.121170 hartree
zpe.sumelectzpe: -514.663300 hartree
zpe.sumelectthermal: -514.653128 hartree
zpe.sumelectthermalent: -514.652184 hartree
zpe.sumelectthermalfe: -514.699012 hartree
dipole: -0.5003 0.3004 0.0112
dipole: 0.5837
quadrupole: -50.7532 -57.2360 -68.2556
quadrupole: -6.5973 0.0043 0.0220
quadrupole: 7.9951 1.5123 -9.5073 -6.5973 0.0043 0.0220
hfenergy: -514.8201823 hartree
pointgroup: C01 [X(C8H9N1O2)]
dipole: -0.1921697 -0.1256453 -0.0046705 debye
dipolederiv: -1.4113138 -0.3821504 0.0104449 -0.8102308 -0.7761924 0.0010051 -0.0034318 -0.007759 -0.2964626 -0.8935048 0.2139317 0.0175926 0.2535894 -0.8684123 -0.0214138 0.0188347 -0.021391 -0.3495981 -0.2815182 0.3589395 0.0037915 0.1069636 -1.2916777 -0.0219394 -0.0040536 -0.0261042 -0.6625085 -0.998418 -0.2088232 0.0113015 0.3887564 -0.3295783 -0.0156056 0.0308304 -0.003773 -0.0845185 0.1866188 -0.5411125 -0.0182366 -0.0110838 1.2491904 0.0361965 -0.0014889 0.0472505 0.1449547 0.4436791 0.0565283 -0.0085105 -0.5005487 0.0766572 0.0152 -0.0263218 0.0043887 -0.0884272 -0.0030338 0.5434449 0.0134455 0.0080721 -0.2875975 -0.0018889 -0.0040713 -0.0125665 -0.2309108 -0.621864 -0.1842853 0.0017043 -0.1470395 -0.0689475 0.0081651 0.0028036 0.0085114 -0.2338981 0.2361841 0.0185124 -0.0059704 0.3185877 0.3719431 0.0092443 0.0035418 0.0153192 -0.1035413 2.1892099 0.1521555 -0.0337838 0.3853283 1.192504 0.0222403 -0.0265571 0.0275344 0.2424708 0.7996394 0.1402851 -0.0062819 0.0477943 0.2415611 -0.0023163 -0.0092351 -0.0041731 0.2842227 0.0762373 -0.0832518 -0.0013148 -0.070287 0.0282379 -0.0026579 -0.0010146 -0.0024275 0.1510073 -0.0057741 -0.0704068 0.0009705 -0.1257711 -0.0719501 -0.0054667 -0.0009086 -0.0066107 0.1682895 0.0467096 0.0602561 0.004439 0.0759613 -0.1026139 -0.010519 0.0048542 -0.0100443 0.1753223 -0.1333613 0.0419577 0.0068136 0.0434706 0.092969 -0.0026963 0.0071306 -0.0025813 0.148601 0.3380326 0.031794 0.0018272 0.017182 0.2738428 -0.0035472 0.001651 -0.0045282 0.3677387 0.1126224 -0.0406646 0.0038014 -0.0182599 0.2344505 -0.004379 0.0043923 -0.0045236 0.3698878 -0.0443116 -0.0263562 0.0182301 0.0805617 0.0661398 -0.0986868 0.0716037 -0.064862 -0.068828 -0.0478327 -0.0219782 -0.0205883 0.0896172 0.0548417 0.1031683 -0.0664816 0.0739365 -0.0533684 0.0119991 -0.0587763 0.0003242 -0.1326639 -0.0853679 -0.0041028 -0.0020778 -0.0055964 0.1195666 unknown
polarizability: 145.0239028|-0.5809875|118.3780775|-1.9683334|2.3646345|46.1985965 unknown
InChI: InChI=1S/C8H9NO2/c1-11-8(10)6-4-2-3-5-7(6)9/h2-5H,9H2,1H3
charge 0 multiplicity 1
20 atoms
O  2.18805 0.970266 -0.073734
O  1.93837 -1.339584 -0.142915
N  -0.560332 -2.318506 -0.126441
C  -0.042473 0.089964 -0.057198
C  -0.983999 -1.00609 -0.074464
C  -0.52689 1.429219 -0.00437
C  -2.381964 -0.697992 -0.038041
C  -1.900378 1.710049 0.031533
C  -2.826693 0.630073 0.013627
C  1.401338 -0.187092 -0.094701
C  3.649497 0.744624 -0.112468
H  0.208944 2.238063 0.007839
H  -3.105666 -1.522141 -0.051386
H  -2.255737 2.74416 0.071923
H  -3.903424 0.834506 0.04108
H  0.450329 -2.498202 -0.154576
H  -1.237291 -3.076689 -0.138936
H  3.93226 0.21049 -1.035306
H  3.970893 0.150227 0.759473
H  4.086965 1.752854 -0.08804
