program: Gaussian 09
title: 000108850
version: EM64L-G09RevD.01
frameworkgroup: C1[X(C5HN)]
method: RPBEPBE
basis: SDD
operation: Freq
keyword: #p
keyword: freq=noraman
keyword: PBEPBE/SDD
title: #p freq=noraman PBEPBE/SDD
converged: NO NO NO NO
title: Mulliken charges:
elementType: N C C C C C H
charge: -0.007048 0.005813 0.054632 -0.126896 0.180276 -0.402388 0.295611
chargesum: 0.00000
title: Mulliken charges with hydrogens summed into heavy atoms:
elementType: N C C C C C
charge: -0.007048 0.005813 0.054632 -0.126896 0.180276 -0.106777
polarizability: 1.60170843e+02 -3.55857755e-02 2.03827111e+01 -1.45852456e-02 6.87036628e-06 2.03820995e+01
1716.lowfreq: 0.0007 0.0007 0.0010 4.9643 4.9696 118.1439 118.1455 273.2560 273.2565
frequency: 118.1429 271.1032 273.2560 487.9623 488.4524 537.9758 538.6257 613.5401 642.7006 643.4791 1187.0404 2029.7693 2171.5390 2268.6431 3431.1424
redmass: 6.9944 7.0180 7.5549 10.4758 10.7445 11.9693 12.0559 9.7554 1.2062 1.2304 10.1330 8.3154 9.1195 11.4770 1.1511
irintensity: 0.0363 4.5593 4.6832 0.0004 0.0005 0.7244 0.7110 0.0080 62.9291 63.5000 1.0452 2.9957 7.4857 78.7334 118.2352
temp: 298.150 k
press: 1.00000 atm
elementType: 7 6 6 6 6 6 1
symmnumber: 1
zpe: 93927.0 jmol-1
zpe.correction: 0.035775 hartree
zpe.thermalcorrener: 0.041527 hartree
zpe.thermalcorrenthalpy: 0.042472 hartree
zpe.thermalcorrgfe: 0.011379 hartree
zpe.sumelectzpe: -245.357823 hartree
zpe.sumelectthermal: -245.352070 hartree
zpe.sumelectthermalent: -245.351126 hartree
zpe.sumelectthermalfe: -245.382218 hartree
dipole: -4.6723 -0.0040 0.0013
dipole: 4.6723
quadrupole: -32.5811 -33.6534 -33.6534
quadrupole: -0.0431 -0.0022 0.0000
quadrupole: 0.7149 -0.3574 -0.3574 -0.0431 -0.0022 0.0000
hfenergy: -245.3935974 hartree
pointgroup: C01 [X(C5H1N1)]
dipole: 1.838239 -0.0005275 0.0021254 debye
dipolederiv: -0.4134033 -0.0003866 0.00118 -0.0001319 -0.2255003 -0.0000011 -0.0001863 -0.0000019 -0.2254938 -0.5255159 -0.000009 0.0003479 -0.0005349 0.0358922 0.0000004 0.0024432 0.0000003 0.0358904 0.5429457 0.0000669 -0.0010622 -0.0001103 0.0495711 -0.0000002 -0.0034609 0. 0.0495718 0.5835326 0.000361 -0.000464 0.0004718 0.0913165 0.0000013 -0.0003817 0.0000017 0.0913113 -0.1277879 0.0000649 0.0001928 0.0005344 0.0051553 -0.0000008 0.0007526 -0.0000007 0.0051552 -0.3947889 -0.0000839 -0.0001699 -0.0000154 -0.2118779 0.0000002 0.0016918 0.0000004 -0.2118796 0.3350178 -0.0000132 -0.0000246 -0.0002137 0.2554433 0.0000002 -0.0008587 0.0000001 0.2554447 unknown
polarizability: 160.1708529|-0.011181|20.3820993|0.0058165|-0.0000158|20.3827019 unknown
InChI: InChI=1S/C5HN/c1-2-3-4-5-6/h1H
charge 0 multiplicity 1
7 atoms
N  -3.210011 0.000387 -0.00538
C  -0.636882 -0.000398 0.004363
C  0.608936 0.000146 0.004415
C  -2.005592 -0.000517 0.000395
C  1.972836 0.000734 0.001078
C  3.213431 -0.000109 -0.002564
H  4.288183 -0.000644 -0.004106
