program: Gaussian 09
title: 000108842
version: EM64L-G09RevD.01
frameworkgroup: C1[X(C8H6Cl5O3P)]
method: RPBEPBE
basis: SDD
operation: Freq
keyword: #p
keyword: freq=noraman
keyword: PBEPBE/SDD
title: #p freq=noraman PBEPBE/SDD
converged: YES YES NO NO
title: Mulliken charges:
elementType: Cl Cl Cl Cl Cl P O O O C C C C C C C C H H H H H H
charge: -0.123746 0.102885 0.133262 0.125486 -0.021677 1.111495 -0.445732 -0.504992 -0.522666 -0.135596 0.473950 -0.586338 -0.282135 -0.299559 -0.205025 -0.204595 -0.224131 0.288075 0.286214 0.285734 0.263303 0.243035 0.242752
chargesum: 0.00000
title: Mulliken charges with hydrogens summed into heavy atoms:
elementType: Cl Cl Cl Cl Cl P O O O C C C C C C C C
charge: -0.123746 0.102885 0.133262 0.125486 -0.021677 1.111495 -0.445732 -0.504992 -0.522666 0.438693 0.473950 -0.586338 -0.282135 -0.013825 0.058278 0.038440 0.018622
polarizability: 1.85585722e+02 2.27318125e+01 1.75979447e+02 4.12230856e+01 -5.96408102e+00 1.48338976e+02
1716.lowfreq: -0.0008 0.0022 0.0027 4.3070 6.2471 7.9670 14.7507 25.8392 28.9446
frequency: 14.5787 25.8151 28.9261 45.4892 66.1435 79.4873 104.9703 107.8348 142.9644 159.9346 173.7918 191.5087 218.0435 235.2269 247.3364 263.0659 292.7411 305.6001 330.4798 351.7159 360.7162 379.1983 425.7433 440.1921 462.1261 512.9069 538.2498 559.3572 619.1098 649.6557 658.1711 686.7442 704.7082 761.2961 762.7140 826.3600 857.2469 944.7085 949.2854 984.4289 1016.1846 1032.8526 1035.5468 1069.3397 1095.9606 1129.5055 1172.3771 1186.5937 1238.4615 1263.0894 1368.2725 1372.8039 1425.0514 1446.5514 1457.6421 1578.7300 1593.0993 3011.8809 3094.0087 3148.0892 3159.7790 3170.4569 3182.0132
redmass: 9.2527 22.0013 16.3034 9.3749 15.0153 13.8996 9.9758 14.1228 8.9434 9.2654 14.2872 18.1761 12.2828 8.8419 9.6905 16.3093 11.7701 13.6810 3.6069 7.9925 10.1481 13.9140 10.0779 3.2938 14.8967 5.4859 6.7396 5.8106 8.7732 5.3415 10.5224 9.2927 3.7651 2.2466 2.2372 7.9094 1.3913 1.3711 10.6375 1.3333 7.0763 1.7529 2.2179 17.4122 6.3183 1.6083 1.2170 2.2434 1.0711 1.4342 1.2386 10.1833 2.1740 1.0725 2.4082 6.3937 7.2349 1.0571 1.1081 1.0863 1.0906 1.0955 1.1010
irintensity: 1.0047 0.3098 0.2373 1.0241 0.5432 1.8971 0.2189 0.7959 0.6406 3.7766 0.0074 1.1454 0.9174 1.7523 5.6255 1.3532 10.9428 24.1334 0.0549 25.8742 7.1906 9.5238 29.0031 11.2124 116.2265 6.5143 20.8107 15.1529 29.7619 130.3823 109.5917 68.2006 0.7660 83.5448 181.2498 140.8505 1.6576 4.5125 214.2777 0.5084 58.4317 22.2954 28.3900 103.1093 9.2749 3.5070 18.3042 86.0681 18.9251 5.2059 5.7444 0.1873 23.1629 12.4265 89.2257 6.9797 2.4765 27.4148 1.1503 2.2044 8.2512 1.0879 8.9455
temp: 298.150 k
press: 1.00000 atm
elementType: 17 17 17 17 17 15 8 8 8 6 6 6 6 6 6 6 6 1 1 1 1 1 1
symmnumber: 1
zpe: 339242.2 jmol-1
zpe.correction: 0.129211 hartree
zpe.thermalcorrener: 0.148085 hartree
zpe.thermalcorrenthalpy: 0.149030 hartree
zpe.thermalcorrgfe: 0.077860 hartree
zpe.sumelectzpe: -3174.350850 hartree
zpe.sumelectthermal: -3174.331976 hartree
zpe.sumelectthermalent: -3174.331031 hartree
zpe.sumelectthermalfe: -3174.402201 hartree
dipole: -2.3869 -2.3819 0.4507
dipole: 3.4020
quadrupole: -126.6835 -144.0386 -144.9189
quadrupole: 10.1939 9.7909 3.5362
quadrupole: 11.8635 -5.4916 -6.3719 10.1939 9.7909 3.5362
hfenergy: -3174.480061 hartree
pointgroup: C01 [X(C8H6Cl5O3P1)]
dipole: -1.1239603 -0.6535814 0.3178717 debye
dipolederiv: -0.3045967 -0.145105 -0.0799902 -0.127544 -0.7591863 -0.1197271 -0.1052322 -0.3079851 -0.326722 -0.2273685 0.0344356 -0.1576347 0.0753016 -0.1759383 0.0836147 -0.1755051 0.0508464 -0.7463764 -0.6004052 -0.0577923 0.27023 -0.0006402 -0.1379037 0.0273225 0.2757881 0.0271671 -0.2865779 -0.4007725 -0.2280725 -0.1279434 -0.2571358 -0.4316621 -0.1398029 -0.1066636 -0.1260006 -0.1778466 -0.2429525 -0.0336073 -0.2429638 -0.0311715 -0.0542433 -0.0001691 -0.2224119 0.0027923 -0.5377149 2.3531792 0.2500601 0.2625373 0.0644529 2.2231315 -0.1117325 -0.1120482 -0.0993072 1.4081188 -1.0601053 0.177946 -0.3306488 0.4883971 -0.727311 0.3209206 -0.5499349 0.4734759 -0.7959546 -1.1686896 -0.4568884 -0.0138849 -0.8309543 -1.0047815 0.0464991 0.0615939 0.0451203 -0.3673328 -0.6694278 -0.0690381 -0.026986 -0.0314902 -0.6001938 0.0138399 0.0456551 0.080621 -0.5923871 0.1698559 -0.1086786 0.1879193 -0.087474 0.161109 -0.1586209 0.6540836 -0.4807286 0.4084408 0.6753125 0.4501292 -0.0901289 0.6799213 0.5855485 -0.0501739 0.2728025 0.1881662 -0.0818688 1.3041916 0.267577 -0.0116249 0.1852056 0.8125508 0.0536398 -0.0711423 0.0980732 1.2717974 0.0115327 -0.0613588 0.4140707 0.0347214 -0.0114255 0.0228931 0.3411873 -0.037159 0.7738605 -0.1483188 0.0065895 0.0213062 0.0061484 -0.0969878 0.0261395 -0.0915184 -0.0998858 -0.0671022 -0.0834116 0.0458319 -0.0948447 0.0062487 -0.0385288 -0.0632977 -0.0707911 -0.0483233 -0.153771 -0.0722315 0.0460164 0.0805281 -0.020385 -0.1026871 -0.0264685 0.1206419 -0.0004297 0.1036536 -0.0471636 0.1179054 0.0324571 0.1144486 -0.0083159 -0.019609 0.0052558 -0.0234041 -0.0234658 0.1011162 0.0196537 0.0450204 0.0586414 0.0652042 0.0116069 -0.0774605 0.0640256 0.0151055 0.0352275 0.0041852 -0.0502357 -0.0562963 -0.0058942 -0.0274909 -0.0833742 0.0659796 0.0263677 0.1436107 -0.0532427 0.0258756 -0.0458362 0.0811068 0.0442359 0.0257262 0.0556348 0.0759944 0.1250297 -0.0425219 0.0064656 -0.0630679 0.0706522 0.0638298 0.0037479 0.0706314 0.0325682 0.081191 -0.0412212 -0.0757465 -0.0416708 0.1155035 0.0129082 -0.0987357 0.0054307 -0.0414383 0.0251967 -0.122803 -0.0437779 -0.1198206 0.0402527 -0.0103575 -0.0416641 -0.004741 0.0826515 unknown
polarizability: 178.6974942|39.8187036|157.7805275|29.4748982|-7.2755548|173.4261221 unknown
InChI: InChI=1S/C8H6Cl4O3P.Cl/c9-6-3-1-2-4-7(6)15-16(13)14-5-8(10,11)12;/h1-4H,5H2;
charge 0 multiplicity 1
23 atoms
Cl 1.232598 3.467463 0.183407
Cl 3.443632 -1.297771 2.768928
Cl 4.552408 -0.992227 -0.03704
Cl 1.946173 -2.470682 0.401138
Cl -1.22948 -0.643875 2.338363
P  0.666527 1.618839 -0.953597
O  1.88252 0.476011 -0.527906
O  -0.704847 1.231969 0.060289
O  0.459097 1.742836 -2.510361
C  2.234571 0.264707 0.892087
C  -1.65339 0.228809 -0.291883
C  2.99946 -1.057673 0.966651
C  -2.025319 -0.698408 0.708132
C  -2.272814 0.191293 -1.561217
C  -3.019135 -1.662604 0.454655
C  -3.260294 -0.78303 -1.820081
C  -3.635399 -1.705677 -0.816632
H  1.325374 0.19852 1.518561
H  2.885265 1.087331 1.23676
H  -1.977126 0.912446 -2.329584
H  -3.29957 -2.369315 1.240985
H  -3.737159 -0.815298 -2.804545
H  -4.40389 -2.458663 -1.01661
