program: Gaussian 09
title: 000008632
version: EM64L-G09RevD.01
frameworkgroup: C1[X(C18H10O7)]
method: RPBEPBE
basis: SDD
operation: Freq
keyword: #pfreq=noraman
keyword: PBEPBE/SDD
title: #p freq=noraman PBEPBE/SDD
converged: NO YES NO NO
title: Mulliken charges:
elementType: O O O O O O O C C C C C C C C C C C C C C C C C C H H H H H H H H H H
charge: -0.254533 -0.254639 -0.208662 -0.135331 -0.135201 -0.198705 -0.198934 0.166971 0.166095 0.254293 0.253882 0.133073 0.133165 0.174372 0.174735 -0.327509 -0.327264 -0.322117 -0.322031 -0.221792 -0.221888 -0.215596 -0.215574 -0.215701 -0.215621 0.268589 0.268618 0.280793 0.280698 0.239086 0.239122 0.239929 0.239927 0.238893 0.238857
chargesum: 0.00000
title: Mulliken charges with hydrogens summed into heavy atoms:
elementType: O O O O O O O C C C C C C C C C C C C C C C C C C
charge: -0.254533 -0.254639 -0.208662 -0.135331 -0.135201 -0.198705 -0.198934 0.166971 0.166095 0.254293 0.253882 0.133073 0.133165 0.174372 0.174735 -0.058920 -0.058646 -0.041324 -0.041333 0.017294 0.017234 0.024333 0.024354 0.023192 0.023236
polarizability: 2.99816631e+02 1.37861638e-02 2.59505276e+02 4.15963841e+01 1.14153598e-01 1.27896050e+02
1716.lowfreq: -5.7648 0.0006 0.0006 0.0008 2.2619 2.4889 20.2708 26.7403 33.2649
frequency: 20.2558 26.7309 33.2182 42.6477 49.0285 63.1006 96.4539 107.1206 111.1302 150.6754 157.7850 164.2268 173.2518 195.4608 227.3288 267.5378 293.9334 320.7203 341.7010 392.8688 400.8206 401.0024 432.5924 433.3278 442.4433 448.0280 503.4172 546.4963 589.8873 612.1324 612.5727 622.2533 646.2146 662.1198 669.7038 682.5545 690.5974 692.3796 696.5040 697.9385 730.4309 764.9002 765.9567 794.1281 795.6677 814.7027 862.7733 863.6185 912.0841 958.2232 958.3906 960.1417 989.7970 989.8659 997.1374 997.4766 1012.9491 1013.0273 1025.5516 1027.0356 1047.9111 1051.8828 1089.3997 1089.9592 1176.0376 1177.3458 1178.4695 1189.2612 1191.5365 1201.7975 1237.0953 1298.9485 1320.8112 1321.3253 1392.5684 1392.8811 1439.9018 1440.0000 1477.2477 1477.8032 1585.1141 1585.3046 1609.8820 1610.6078 1632.0052 1661.0049 1669.5898 1691.8238 1756.5343 3136.1697 3136.2716 3148.1827 3148.2464 3159.3543 3159.4299 3170.7713 3170.9025 3185.9859 3186.3055
redmass: 6.4385 4.9021 4.3742 6.5355 7.8438 7.7605 11.6274 7.5382 8.9810 6.7884 8.6640 8.0148 8.9265 8.8230 7.1569 10.0744 8.7675 10.5457 12.2482 12.3338 2.8066 2.8089 3.8358 4.0943 8.6533 7.9523 10.9312 11.4639 13.9992 6.5156 6.4632 11.4950 9.3012 5.3918 5.7041 7.8114 7.1254 8.4530 1.7801 1.7752 10.6106 13.7285 10.3911 2.0460 2.0767 10.7595 1.2472 1.2456 9.1187 1.4127 1.5931 5.1234 6.2316 6.2217 1.3914 1.3908 1.3412 1.3407 2.2581 2.1379 9.1078 10.1377 1.5855 1.6014 1.3760 1.0588 1.2630 1.1512 9.8907 1.9020 4.1922 6.9657 1.3088 1.3315 9.6800 9.7694 2.2548 2.2566 2.2329 2.2462 6.1825 6.1611 6.0820 5.9685 11.7385 12.5683 12.6137 13.1683 13.0228 1.0861 1.0860 1.0893 1.0893 1.0942 1.0942 1.0989 1.0990 1.0974 1.0973
irintensity: 0.7845 1.4401 0.0889 0.0007 0.0993 0.4182 5.8399 0.0832 0.3873 0.0177 0.4627 1.1315 0.7164 0.2690 6.0525 2.9557 13.3975 2.0200 4.7829 8.6377 0.0025 0.0048 1.1027 0.0433 1.1841 0.4039 1.5887 6.8876 0.3081 1.5031 1.7024 11.0817 15.4215 12.7761 6.1232 37.4390 1.0756 2.6250 146.0284 30.8535 1.7029 12.1888 42.7566 52.1957 4.5801 50.6471 0.2759 0.0007 402.4772 6.8623 23.8944 193.2648 5.2484 4.2386 0.0179 0.0008 0.2589 0.0004 9.3329 5.0576 273.3098 687.7429 34.9233 6.7347 227.9339 0.4465 169.4829 43.1574 1.6002 194.4324 391.0474 14.0781 0.9968 3.3038 0.6907 6.5309 26.6918 13.0226 2.1207 7.6240 20.0146 2.4808 72.1401 44.6366 172.8326 416.1024 16.1670 545.1439 81.8946 0.4108 0.3400 5.6479 6.8741 25.3996 2.0892 14.0971 25.3114 5.4713 5.1579
temp: 298.150 k
press: 1.00000 atm
elementType: 8 8 8 8 8 8 8 6 6 6 6 6 6 6 6 6 6 6 6 6 6 6 6 6 6 1 1 1 1 1 1 1 1 1 1
symmnumber: 1
zpe: 625334.1 jmol-1
zpe.correction: 0.238177 hartree
zpe.thermalcorrener: 0.259037 hartree
zpe.thermalcorrenthalpy: 0.259981 hartree
zpe.thermalcorrgfe: 0.185447 hartree
zpe.sumelectzpe: -1216.748217 hartree
zpe.sumelectthermal: -1216.727357 hartree
zpe.sumelectthermalent: -1216.726413 hartree
zpe.sumelectthermalfe: -1216.800947 hartree
dipole: 0.0050 -8.5485 -0.0042
dipole: 8.5485
quadrupole: -116.7788 -149.9521 -140.9422
quadrupole: -0.0097 4.8705 0.0995
quadrupole: 19.1122 -14.0611 -5.0511 -0.0097 4.8705 0.0995
hfenergy: -1216.9863939 hartree
pointgroup: C01 [X(C18H10O7)]
dipole: -0.1173097 -3.3611759 -0.0037591 debye
polarizability: 298.752714|-1.4083859|259.555613|43.6081092|-1.3510112|128.90963 unknown
InChI: InChI=1S/C18H10O7/c19-15(11-7-3-1-4-8-11)23-13-14(18(22)25-17(13)21)24-16(20)12-9-5-2-6-10-12/h1-10H
charge 0 multiplicity 1
35 atoms
O  -1.629997 1.068625 -0.139229
O  1.691811 0.94915 0.152644
O  0.147193 4.250971 -0.001705
O  -2.171936 3.922248 -0.216139
O  2.437241 3.758394 0.213566
O  -0.625996 -0.363879 1.424866
O  0.587503 -0.405661 -1.412755
C  -0.619434 1.998086 -0.055204
C  0.751074 1.949419 0.065195
C  -2.702019 -1.040303 0.309767
C  2.614261 -1.227727 -0.305295
C  -1.044693 3.435551 -0.112274
C  1.278105 3.352651 0.113194
C  -1.552772 -0.167529 0.617888
C  1.527312 -0.276612 -0.607429
C  -2.782011 -2.284751 0.992701
C  2.607841 -2.4703 -0.996193
C  -3.70447 -0.672954 -0.627612
C  3.641215 -0.935436 0.632004
C  -3.857773 -3.156164 0.736999
C  3.622447 -3.414443 -0.749129
C  -4.778687 -1.551027 -0.876451
C  4.653655 -1.886256 0.872489
C  -4.85741 -2.790745 -0.197573
C  4.646474 -3.123845 0.185261
H  -1.998998 -2.546202 1.712205
H  1.807514 -2.673265 -1.715524
H  -3.633542 0.287153 -1.144897
H  3.637437 0.024046 1.155181
H  -3.921015 -4.115003 1.261815
H  3.619479 -4.371877 -1.280238
H  -5.553834 -1.270889 -1.597064
H  5.447726 -1.664304 1.592772
H  -5.694653 -3.469286 -0.395074
H  5.436154 -3.858938 0.376336
