program: Gaussian 09
title: 000008615
version: EM64L-G09RevD.01
frameworkgroup: C1[X(C15H15NO2)]
method: RPBEPBE
basis: SDD
operation: Freq
keyword: #p
keyword: freq=noraman
keyword: PBEPBE/SDD
title: #p freq=noraman PBEPBE/SDD
converged: YES YES NO NO
title: Mulliken charges:
elementType: O O N C C C C C C C C C C C C C C C H H H H H H H H H H H H H H H
charge: -0.288795 -0.325317 -0.684078 -0.578928 0.492968 -0.243445 -0.412799 -0.371782 0.065548 0.325236 0.244295 -0.224189 -0.228816 -0.305951 -0.242644 -0.396469 -0.270050 -0.194297 0.225336 0.206089 0.234205 0.235183 0.227970 0.228055 0.223861 0.224552 0.261668 0.227232 0.218278 0.228094 0.224153 0.374518 0.300318
chargesum: 0.00000
title: Mulliken charges with hydrogens summed into heavy atoms:
elementType: O O N C C C C C C C C C C C C C C C
charge: -0.288795 -0.325317 -0.009241 -0.147504 0.492968 0.225943 -0.184829 -0.143727 0.065548 0.325236 0.244295 -0.000327 -0.004264 -0.044283 -0.015413 -0.178190 -0.041956 0.029857
polarizability: 2.11987855e+02 7.69078364e+00 2.01571453e+02 -6.08363786e+00 -1.00872039e+01 1.08777172e+02
1716.lowfreq: -4.0303 -2.1185 -0.0007 0.0004 0.0005 6.8676 16.7068 18.7279 32.5838
frequency: 15.2192 18.2560 32.5735 65.0522 96.3150 112.9835 140.1725 174.3327 209.2564 248.5024 281.6476 325.4431 346.1038 397.7138 404.3220 424.5604 428.3745 468.5100 480.8078 493.5074 525.5162 553.0309 566.6746 617.9090 655.8431 677.5706 704.6049 730.1621 751.8659 758.3338 764.5713 779.4334 781.1313 808.0514 852.0806 854.3375 865.4926 912.8442 959.7094 961.7385 975.1728 982.0940 984.9690 991.9771 993.6762 1021.6483 1028.3653 1042.9005 1053.0348 1063.1396 1090.9188 1153.3435 1171.9128 1174.9333 1183.3516 1188.2543 1215.4298 1229.5085 1256.1456 1287.8562 1327.0468 1331.5674 1335.9983 1362.0671 1383.7791 1404.2644 1440.8707 1444.8676 1460.1277 1469.6668 1485.3317 1486.8643 1537.4500 1579.1612 1594.5074 1615.5066 1620.1177 1635.2021 2993.9833 3006.2507 3053.4820 3075.0286 3112.1447 3119.4133 3121.3004 3133.6751 3140.3822 3144.4762 3157.6765 3162.5762 3178.8246 3406.4813 3649.3784
redmass: 4.7627 4.4800 4.3516 5.2941 4.9892 7.3293 4.2720 3.7469 3.5064 4.0999 6.0575 4.0758 2.2246 5.5328 2.8184 3.3461 2.7658 1.2576 4.0051 3.8767 3.0940 6.0988 3.0243 6.2891 6.4245 4.5086 1.7556 1.2919 3.1661 1.6721 1.8627 2.3800 3.6166 3.8932 1.2782 1.4916 4.5108 1.4299 2.5369 1.3644 1.3993 1.3698 2.2972 3.2702 1.4835 2.3452 2.1030 2.6812 2.4201 2.2991 1.6222 1.2969 1.0569 1.0584 1.1772 1.1194 2.1460 1.2195 3.0002 1.8662 1.3262 1.9341 1.4509 1.5100 7.1410 6.0204 2.1545 2.9925 1.1157 1.1034 2.2762 2.5480 3.9306 7.1487 6.0666 6.0312 1.4745 7.1135 1.0601 1.0585 1.1006 1.1075 1.0873 1.0864 1.0859 1.0913 1.0917 1.0961 1.0933 1.1015 1.0978 1.0557 1.0948
irintensity: 0.0234 0.1199 0.0731 2.3460 1.1008 0.6869 0.7113 5.1418 2.2458 1.0979 8.8078 1.4504 1.6315 4.0047 0.0227 8.2715 26.0142 111.1469 3.6692 19.1855 22.9977 0.6372 20.2141 0.2882 5.6952 17.0815 59.2764 93.0038 19.5885 115.5917 34.7548 4.6881 6.7907 3.9363 0.7975 1.8978 6.1769 1.5190 3.6113 1.7061 0.1196 0.1599 1.4771 0.5708 0.5492 9.7928 5.6694 91.0604 84.8199 237.1676 7.7236 13.3032 0.1039 34.4337 0.7752 0.8331 15.1971 10.2524 496.1662 12.7330 1.5860 11.2727 2.1091 16.1741 0.0691 9.3376 7.2866 3.3078 14.6549 8.8063 23.7702 35.7264 248.6833 105.3019 1.0322 8.6028 117.9891 208.7137 19.8772 31.2245 14.4205 35.4821 9.2011 8.2913 4.0277 15.3678 24.8359 48.0155 16.6972 19.7222 11.7753 104.9872 57.1621
temp: 298.150 k
press: 1.00000 atm
elementType: 8 8 7 6 6 6 6 6 6 6 6 6 6 6 6 6 6 6 1 1 1 1 1 1 1 1 1 1 1 1 1 1 1
symmnumber: 1
zpe: 695644.4 jmol-1
zpe.correction: 0.264957 hartree
zpe.thermalcorrener: 0.280797 hartree
zpe.thermalcorrenthalpy: 0.281741 hartree
zpe.thermalcorrgfe: 0.218728 hartree
zpe.sumelectzpe: -784.534390 hartree
zpe.sumelectthermal: -784.518551 hartree
zpe.sumelectthermalent: -784.517606 hartree
zpe.sumelectthermalfe: -784.580619 hartree
dipole: 0.6134 0.0925 0.0362
dipole: 0.6214
quadrupole: -87.1173 -97.1615 -106.3798
quadrupole: 2.9003 1.2124 -0.6165
quadrupole: 9.7689 -0.2753 -9.4936 2.9003 1.2124 -0.6165
hfenergy: -784.7993474 hartree
pointgroup: C01 [X(C15H15N1O2)]
dipole: -0.2417861 -0.0291708 0.0215051 debye
polarizability: 212.9476223|7.3946643|197.8857956|2.8767584|19.1555595|111.5030613 unknown
InChI: InChI=1S/C15H15NO2/c16-14-9-5-4-8-13(14)15(17)18-11-10-12-6-2-1-3-7-12/h1-9H,10-11,16H2
charge 0 multiplicity 1
33 atoms
O  0.038225 0.981027 -0.375716
O  -1.438029 2.392418 0.734888
N  -3.925748 1.488027 1.172552
C  2.280944 1.609059 -1.08955
C  2.995589 0.386449 -0.529566
C  1.063887 2.052992 -0.262551
C  4.015527 0.531224 0.445765
C  2.641862 -0.920664 -0.950489
C  -2.161118 0.148871 0.091507
C  -3.507652 0.308389 0.591063
C  -1.205951 1.263027 0.195033
C  4.663023 -0.600235 0.991981
C  3.287312 -2.054915 -0.408965
C  -1.772942 -1.092241 -0.491412
C  4.300151 -1.898797 0.565783
C  -4.410571 -0.79603 0.46765
C  -2.671345 -2.16341 -0.599667
C  -3.999357 -2.002286 -0.115095
H  1.944876 1.422596 -2.126248
H  2.975846 2.470903 -1.122276
H  0.632964 2.996437 -0.644165
H  1.314625 2.188267 0.805432
H  4.308972 1.536187 0.776013
H  1.855433 -1.04574 -1.704342
H  5.450919 -0.469579 1.742621
H  3.002166 -3.058025 -0.746262
H  -0.743596 -1.18854 -0.847744
H  4.802375 -2.777623 0.985617
H  -5.435948 -0.684748 0.84086
H  -2.356269 -3.110714 -1.047568
H  -4.712996 -2.830791 -0.193726
H  -3.244059 2.251617 1.256619
H  -4.877715 1.582051 1.516361
