program: Gaussian 09
title: 000108661
version: EM64L-G09RevD.01
frameworkgroup: C1[X(C10H13ClN2O)]
method: RPBEPBE
basis: SDD
operation: Freq
keyword: #p
keyword: freq=noraman
keyword: PBEPBE/SDD
title: #p freq=noraman PBEPBE/SDD
converged: YES YES NO NO
title: Mulliken charges:
elementType: Cl O N N C C C C C C C C C C H H H H H H H H H H H H H
charge: -0.068896 -0.248768 -0.178513 -0.706850 -0.375285 -0.377747 -0.309913 -0.323029 0.527790 -0.273477 -0.305004 -0.454346 -0.461315 0.547633 0.233993 0.209355 0.194480 0.228744 0.212736 0.202016 0.196171 0.213921 0.239039 0.245069 0.217850 0.306809 0.307537
chargesum: 0.00000
title: Mulliken charges with hydrogens summed into heavy atoms:
elementType: Cl O N N C C C C C C C C C C
charge: -0.068896 -0.248768 -0.178513 -0.092503 0.068063 0.045478 0.104839 0.087063 0.527790 -0.273477 -0.065966 -0.209277 -0.243465 0.547633
polarizability: 1.94219932e+02 -8.31313012e+00 1.39128274e+02 1.14581760e+00 -1.20634499e+00 7.89377864e+01
1716.lowfreq: -20.9087 -6.2798 0.0025 0.0030 0.0033 7.5004 53.5596 61.5928 86.3805
frequency: 53.3885 61.1630 86.3026 167.4292 184.6454 205.6311 230.5205 255.8538 273.4670 319.1582 327.8653 333.3586 382.3106 395.2689 400.6036 444.1306 463.1891 485.8855 510.8778 585.8713 592.8423 670.9789 692.8888 705.9463 797.4172 802.7633 842.1561 845.7231 866.8154 904.3701 917.6416 926.6860 1009.9212 1025.2160 1030.0031 1049.0044 1054.6531 1078.8726 1101.8162 1141.9809 1164.6340 1192.1778 1222.4589 1239.4581 1261.6889 1280.1090 1314.4140 1330.7713 1341.4225 1350.2834 1361.5467 1370.0203 1372.4317 1430.5245 1441.2705 1447.3509 1448.6510 1456.2779 1509.6930 1555.1897 1634.3052 1646.8395 2878.5183 2904.2954 2956.9555 2965.0140 3043.2213 3077.4907 3077.9541 3084.8366 3123.9612 3148.5373 3155.0528 3572.4689 3712.6643
redmass: 4.4728 4.1618 4.6391 4.8960 4.8864 6.2395 3.3911 2.0518 4.7888 3.5401 1.2313 1.0614 2.9373 2.6407 5.3033 3.0500 2.8282 5.6215 3.7975 3.1155 2.6528 6.3016 3.2254 3.5491 2.6148 1.8521 1.6279 1.6493 5.5384 2.2705 3.4638 1.5394 2.7998 2.2336 1.4977 1.9940 2.1910 4.0056 2.2009 2.0653 1.8508 1.0862 1.4718 1.2847 1.4525 1.2178 1.8801 1.3126 1.3123 2.6935 2.3614 1.6383 1.4469 3.6611 1.0829 1.1104 1.0979 1.1060 3.5156 7.0101 1.7981 2.2051 1.0692 1.0708 1.0660 1.0659 1.0905 1.0911 1.0972 1.0980 1.0882 1.0919 1.0946 1.0449 1.1041
irintensity: 0.6460 1.1594 0.5615 1.1446 9.0207 0.7911 8.5980 1.0126 8.3593 8.5426 316.4592 0.0518 3.2042 1.1060 1.4802 4.8640 3.1994 6.9955 4.7712 9.2583 8.6528 9.7975 7.7144 0.7087 10.8098 31.8037 0.1248 44.6588 72.4464 12.1535 37.3888 6.2351 31.7147 8.3597 2.8958 17.3499 9.4712 42.8183 2.6913 5.1212 10.5574 2.8413 131.6687 19.0862 26.1055 9.0436 32.5985 3.6201 4.1165 0.6558 26.0335 6.9741 13.4946 0.7820 3.2893 4.9191 28.6051 25.1941 322.3712 17.0820 9.3309 237.3924 72.1984 87.6114 51.4861 78.3343 30.4479 17.6455 33.4351 41.8681 22.0432 10.9214 10.2923 85.0010 21.4619
temp: 298.150 k
press: 1.00000 atm
elementType: 17 8 7 7 6 6 6 6 6 6 6 6 6 6 1 1 1 1 1 1 1 1 1 1 1 1 1
symmnumber: 1
zpe: 570003.3 jmol-1
zpe.correction: 0.217103 hartree
zpe.thermalcorrener: 0.230241 hartree
zpe.thermalcorrenthalpy: 0.231186 hartree
zpe.thermalcorrgfe: 0.177492 hartree
zpe.sumelectzpe: -1032.571840 hartree
zpe.sumelectthermal: -1032.558701 hartree
zpe.sumelectthermalent: -1032.557757 hartree
zpe.sumelectthermalfe: -1032.611451 hartree
dipole: 4.0009 -1.8022 0.2315
dipole: 4.3942
quadrupole: -77.9571 -84.0779 -92.3257
quadrupole: -3.7511 2.5928 2.6882
quadrupole: 6.8298 0.7090 -7.5388 -3.7511 2.5928 2.6882
hfenergy: -1032.7889425 hartree
pointgroup: C01[X(C10H13Cl1N2O1)]
dipole: 1.5841853 -0.6874452 -0.0807243 debye
polarizability: 194.4492759|-7.5693086|135.8189331|-0.7067906|13.2886619|82.0177832 unknown
InChI: InChI=1S/C10H13ClN2O/c11-9-7-8(12)1-2-10(9)13-3-5-14-6-4-13/h1-2,7H,3-6,12H2
charge 0 multiplicity 1
27 atoms
Cl 0.344293 2.69398 0.285772
O  -4.008083 -0.304414 0.153348
N  -1.132604 -0.044194 -0.069797
N  4.587574 -0.310426 0.053966
C  -1.842003 0.347153 1.180494
C  -1.852193 -1.125338 -0.777756
C  -3.279377 0.774162 0.846385
C  -3.291357 -0.667901 -1.079229
C  0.29261 -0.118416 -0.022541
C  1.111202 1.032294 0.15472
C  1.000168 -1.344018 -0.194759
C  2.512789 0.987209 0.200424
C  2.405154 -1.419047 -0.186844
C  3.191144 -0.252551 0.026201
H  -1.310878 1.18485 1.660706
H  -1.866093 -0.510022 1.894363
H  -1.896771 -2.06464 -0.173666
H  -1.332544 -1.34786 -1.727614
H  -3.857515 0.976245 1.763103
H  -3.255706 1.682046 0.206892
H  -3.26466 0.203218 -1.768787
H  -3.877735 -1.484808 -1.532393
H  0.426293 -2.266601 -0.32973
H  3.077519 1.914504 0.341983
H  2.896965 -2.388439 -0.331691
H  5.072549 -1.192683 -0.075884
H  5.142558 0.526598 0.201935
