program: Gaussian 09
title: 000108619
version: EM64L-G09RevD.01
frameworkgroup: C1[X(C15H30O3S)]
method: RPBEPBE
basis: SDD
operation: Freq
keyword: #p
keyword: freq=noraman
keyword: PBEPBE/SDD
title: #p freq=noraman PBEPBE/SDD
converged: YES YES NO NO
title: Mulliken charges:
elementType: S O O O C C C C C C C C C C C C C C C H H H H H H H H H H H H H H H H H H H H H H H H H H H H H H
charge: 1.032945 -0.575222 -0.517905 -0.518095 -0.385934 -0.387243 -0.386490 -0.385500 -0.384457 -0.384073 -0.385380 -0.375782 -0.373111 -0.328208 -0.381398 -0.607479 -0.456723 -0.034754 -0.598240 0.194807 0.194194 0.196676 0.196529 0.194785 0.194921 0.196238 0.196673 0.194082 0.193445 0.202718 0.202842 0.195505 0.193703 0.205585 0.205394 0.190344 0.195596 0.236305 0.237329 0.194776 0.212022 0.291550 0.291284 0.198300 0.204819 0.211868 0.379740 0.213884 0.217133
chargesum: 0.00000
title: Mulliken charges with hydrogens summed into heavy atoms:
elementType: S O O O C C C C C C C C C C C C C C C
charge: 1.032945 -0.195482 -0.517905 -0.518095 0.003066 0.005962 0.003216 0.007411 0.003070 0.021487 0.003828 0.035197 0.012830 0.145426 0.025401 -0.024645 -0.053604 0.177114 -0.167223
polarizability: 2.87402023e+02 6.52626411e+00 1.65518887e+02 -9.00422162e+00 1.19551792e+00 1.65323035e+02
1716.lowfreq: -48.5355 -11.1031 -6.2160 -1.3575 -0.0028 -0.0023 -0.0011 5.9161 14.5522
frequency: -40.9790 -1.1433 13.8083 19.3471 34.3464 37.1956 44.8639 59.0540 73.8216 76.7995 89.1575 102.5057 108.0450 112.1064 128.7686 131.1968 140.6076 151.2241 153.3493 174.7741 191.1114 210.2614 236.8135 252.0672 298.4603 299.1492 319.1104 337.9426 380.9698 397.7537 429.5731 444.7215 487.9915 496.5381 554.4365 602.2333 636.4700 715.5922 720.7813 726.6942 736.1249 752.6091 772.5206 800.9136 840.9334 844.4889 885.1922 917.9639 927.7185 939.5110 954.1621 975.9726 980.3093 985.2080 1002.1578 1005.3132 1010.3383 1023.1555 1030.7344 1039.3187 1044.7228 1055.8409 1066.9829 1074.2262 1077.2388 1081.5299 1082.2374 1097.1435 1103.3483 1173.4017 1186.1158 1197.7295 1208.6527 1219.9453 1231.0215 1239.1978 1252.0249 1257.4150 1269.8608 1275.8698 1278.1791 1282.4187 1286.1962 1289.3591 1293.3142 1295.1857 1299.8201 1300.2904 1304.2579 1318.4144 1333.8499 1344.3235 1349.9876 1351.8509 1355.4872 1357.1628 1413.6585 1425.5857 1455.5392 1457.2571 1459.0065 1460.9543 1462.8996 1464.7789 1468.0074 1472.4643 1477.6055 1482.4382 1485.7016 1490.1790 1657.6627 2947.4010 2947.6820 2949.0202 2950.3260 2951.5561 2953.6184 2957.4778 2961.3554 2964.4268 2965.8606 2972.3525 2980.3825 2984.6106 2989.8638 2996.1709 2997.5102 3003.8805 3009.6196 3016.3653 3025.5038 3034.5252 3042.0945 3044.9651 3055.1290 3064.3899 3069.9593 3089.0426 3146.8461 3192.6703 3501.2998
redmass: 2.0133 5.7308 5.3534 4.5362 2.6512 2.4391 3.6571 3.1520 2.0870 2.9913 3.2842 2.1371 2.4419 4.2985 2.4444 2.1502 2.9259 2.0733 2.1000 1.6329 3.6042 5.0248 2.0496 3.3264 5.3277 4.8921 3.6233 5.3849 4.8187 2.8934 3.5092 2.5758 2.9858 3.0552 12.5961 5.2748 1.5393 1.0615 1.0711 1.0778 1.1023 1.1237 1.1654 1.2335 1.2861 11.6863 1.3279 1.8774 1.6822 1.3588 2.1616 5.2134 4.5165 1.4060 1.1424 3.5024 3.1397 1.3071 1.4751 2.4385 1.9432 1.9494 2.7599 2.6795 2.3330 2.1438 2.2373 1.2788 4.2125 1.9714 1.5851 1.3639 1.5096 1.2963 1.3938 1.2793 1.3055 1.2795 1.2163 1.2162 1.0848 1.1100 1.1009 1.1813 1.0842 1.1452 1.2959 1.1055 1.1035 1.3400 1.3853 1.4405 1.5253 1.6835 1.5914 1.6119 1.1046 1.1777 1.0875 1.0737 1.0780 1.0675 1.0738 1.0734 1.0836 1.0932 1.0982 1.1002 1.1004 1.1005 4.7479 1.0587 1.0585 1.0598 1.0610 1.0590 1.0592 1.0594 1.0591 1.0592 1.0598 1.0587 1.0961 1.0970 1.0984 1.0998 1.0588 1.1002 1.1005 1.1027 1.1043 1.1046 1.1040 1.1044 1.0560 1.1050 1.0795 1.0739 1.1107 1.1144 1.0665
irintensity: 0.4090 0.2816 0.3080 0.5517 0.1909 0.3705 0.7679 0.1710 0.2572 0.5575 1.1833 0.0982 0.4110 0.5748 0.1613 0.1745 0.6498 0.3542 0.6186 41.1510 0.8103 11.4399 42.0968 2.6940 16.7489 56.9939 7.8564 4.2306 19.9751 15.1226 7.6753 2.7046 0.5735 8.3202 147.2776 5.2077 16.4116 13.8388 2.3623 9.3008 1.1320 3.5726 0.7518 0.6121 2.0947 45.1009 3.5389 1.9918 21.2744 90.2500 40.5131 0.7090 0.9554 19.3429 9.1692 6.9495 7.3349 10.7045 40.7067 7.4653 10.5597 0.4575 1.7311 7.6009 0.6193 0.0032 0.3912 17.3281 2.2825 8.2605 15.2271 23.7847 1.1381 1.6801 1.0857 1.4709 1.2831 3.2769 0.6322 1.7273 1.4250 0.9415 0.2067 0.4572 0.1492 0.0258 4.9776 0.0800 0.0016 3.1499 6.5401 3.6666 1.5892 0.0154 0.0143 0.8614 6.3694 3.5005 2.0957 0.0179 1.4398 0.0975 0.3272 0.8737 1.2189 1.5144 0.5526 8.3820 9.6888 32.5082 22.2946 0.0337 0.1226 2.0795 16.7486 0.1338 2.1721 3.4554 32.1467 3.0813 186.2856 118.3794 0.7200 0.6607 1.1477 0.8917 18.1406 2.3868 1.3015 1.0057 0.6842 4.3919 20.9411 310.5767 4.9938 53.1795 47.1089 7.4843 1.1237 33.4610 49.5761
temp: 298.150 k
press: 1.00000 atm
elementType: 16 8 8 8 6 6 6 6 6 6 6 6 6 6 6 6 6 6 6 1 1 1 1 1 1 1 1 1 1 1 1 1 1 1 1 1 1 1 1 1 1 1 1 1 1 1 1 1 1
symmnumber: 1
zpe: 1112219.2 jmol-1
zpe.correction: 0.423622 hartree
zpe.thermalcorrener: 0.447942 hartree
zpe.thermalcorrenthalpy: 0.448886 hartree
zpe.thermalcorrgfe: 0.365169 hartree
zpe.sumelectzpe: -1211.562424 hartree
zpe.sumelectthermal: -1211.538104 hartree
zpe.sumelectthermalent: -1211.537160 hartree
zpe.sumelectthermalfe: -1211.620878 hartree
dipole: -2.7161 2.7466 -0.2513
dipole: 3.8710
quadrupole: -167.6361 -134.5993 -131.3864
quadrupole: 20.0533 0.9941 0.8583
quadrupole: -23.0955 9.9413 13.1542 20.0533 0.9941 0.8583
hfenergy: -1211.9860464 hartree
pointgroup: C01 [X(C15H30O3S1)]
dipole: -1.068218 -1.0853562 -0.0178044 debye
polarizability: 287.5202773|-7.4442192|165.2371029|7.3275425|1.2437179|165.4865646 unknown
InChI: InChI=1S/C15H30O3S/c1-2-3-4-5-6-7-8-9-10-11-12-13-14-15-19(16,17)18/h2,16H,1,3-15H2
charge 0 multiplicity 1
49 atoms
S  8.254306 0.342934 -0.104637
O  9.367433 -1.143999 -0.306316
O  8.462659 0.986314 1.36564
O  8.370971 1.29553 -1.407754
C  -1.032081 -0.568378 -0.080956
C  0.274852 0.241293 0.074284
C  -2.306457 0.274582 0.149338
C  1.547848 -0.618628 -0.094674
C  -3.61304 -0.523408 -0.059465
C  2.853046 0.203637 -0.005131
C  -4.888475 0.307715 0.205839
C  4.1232 -0.670697 -0.121313
C  -6.193991 -0.483969 -0.031602
C  5.420011 0.179167 -0.064456
C  -7.468434 0.34405 0.245973
C  6.649312 -0.720887 -0.170972
C  -8.775077 -0.455706 -0.005153
C  -10.021998 0.338976 0.321155
C  -11.031145 0.613917 -0.543613
H  -1.066598 -1.015106 -1.096778
H  -1.023975 -1.419672 0.631963
H  0.29047 0.725997 1.072814
H  0.28529 1.064306 -0.670661
H  -2.298161 1.1480 -0.536197
H  -2.289841 0.688913 1.179205
H  1.557553 -1.41146 0.682268
H  1.509834 -1.141438 -1.073195
H  -3.640123 -0.914551 -1.098212
H  -3.61068 -1.412123 0.606318
H  2.875378 0.756637 0.956401
H  2.859686 0.969639 -0.807556
H  -4.882413 1.207048 -0.445115
H  -4.871007 0.681608 1.251079
H  4.130016 -1.418017 0.698054
H  4.091959 -1.240319 -1.072461
H  -6.197349 -1.388755 0.612357
H  -6.215091 -0.849401 -1.079705
H  5.447366 0.747526 0.884919
H  5.416137 0.913182 -0.892718
H  -7.454056 0.700776 1.296988
H  -7.471887 1.25092 -0.391454
H  6.748198 -1.245301 -1.134405
H  6.784511 -1.412155 0.675736
H  -8.748065 -1.372632 0.622324
H  -8.809238 -0.792478 -1.059779
H  -10.086601 0.721155 1.353272
H  10.315011 -0.825589 -0.29116
H  -11.905985 1.200954 -0.2414
H  -11.009579 0.257492 -1.581391
