program: Gaussian 09
title: 000108571
version: EM64L-G09RevD.01
frameworkgroup: C1[X(C13H19NO2)]
method: RPBEPBE
basis: SDD
operation: Freq
keyword: #p
keyword: freq=noraman
keyword: PBEPBE/SDD
title: #p freq=noraman PBEPBE/SDD
converged: YES YES NO NO
title: Mulliken charges:
elementType: O O N C C C C C C C C C C C C C H H H H H H H H H H H H H H H H H H H
charge: -0.253775 -0.435957 -0.327531 -0.069247 -0.632493 -0.316551 0.402521 -0.399565 -0.276250 0.345052 -0.615023 0.345396 -0.603715 0.146525 -0.847092 -0.791532 0.217938 0.239178 0.191273 0.241316 0.180341 0.254719 0.193744 0.209118 0.194326 0.208104 0.242913 0.218171 0.230676 0.234664 0.229257 0.213883 0.238891 0.237865 0.352863
chargesum: 0.00000
title: Mulliken charges with hydrogens summed into heavy atoms:
elementType: O O N C C C C C C C C C C C C C
charge: -0.253775 -0.083095 -0.072812 0.148691 -0.202043 0.105106 0.402521 0.003297 0.126180 0.345052 -0.372110 0.345396 -0.385544 0.146525 -0.152496 -0.100893
polarizability: 1.99235062e+02 -1.21232338e+01 1.53441308e+02 -1.44788907e+01 -9.79834861e+00 1.09730861e+02
1716.lowfreq: -6.7968 0.0002 0.0007 0.0007 5.7031 10.7555 35.2018 43.3849 50.6463
frequency: 35.1765 43.3455 50.6276 97.5083 104.2968 119.9257 147.4910 178.6907 224.4103 248.0587 257.8329 275.6733 300.1930 315.1199 347.0332 351.5793 372.5393 426.9963 435.8652 448.2913 462.4886 476.8468 523.5139 547.3241 564.2540 629.7844 679.0984 693.5505 729.8660 747.5556 797.6131 815.5228 835.5116 848.8230 883.9924 900.2791 911.3308 965.7815 992.9851 1010.8380 1034.5518 1038.3825 1047.3894 1050.3765 1063.1014 1075.2992 1089.3358 1103.5429 1132.5629 1150.7288 1183.0914 1201.6344 1203.9063 1224.4709 1231.2249 1274.7681 1283.7971 1293.0331 1303.9782 1309.8626 1323.2238 1340.2602 1363.5871 1376.1627 1383.1547 1394.9627 1399.4694 1405.2357 1442.2258 1446.6609 1450.4972 1456.9980 1457.3378 1463.7166 1471.1979 1475.8354 1485.7527 1512.2598 1600.1888 1626.7579 2863.0615 2883.3804 2940.5504 2956.6343 2969.4057 2970.2755 2981.4616 3032.2109 3036.5587 3044.9938 3059.4568 3079.4989 3081.2969 3088.9233 3094.7271 3098.4951 3113.7310 3435.7872 3579.7584
redmass: 3.6198 4.1808 4.3319 1.0323 1.8711 1.4942 2.9431 3.8047 3.6724 2.3126 3.4585 3.1946 2.7039 2.9908 2.4089 2.1042 1.4009 4.2237 3.9284 2.9519 2.5743 2.8028 3.4872 3.3954 2.0871 3.6112 2.4523 2.8651 4.2531 3.5005 2.8902 2.9279 1.4709 2.3761 1.8621 1.4664 2.3367 2.6804 1.5726 1.4875 2.0980 1.6687 1.5154 2.4549 3.3903 3.2161 1.9097 2.2513 2.0044 2.6594 1.3422 1.2336 1.3518 1.8576 1.3456 1.2585 1.6690 1.2328 2.2986 1.3615 1.3949 1.2638 1.3188 1.6085 3.3322 1.8789 1.2646 1.9394 1.0916 1.2495 1.1603 1.0898 1.0504 1.0831 1.0575 1.1252 1.1487 3.3355 6.2369 6.9144 1.0806 1.0695 1.0681 1.0661 1.0622 1.0386 1.0364 1.0908 1.0976 1.0969 1.0969 1.0982 1.0973 1.1002 1.0958 1.0906 1.0911 1.0750 1.0659
irintensity: 0.8502 0.0682 0.2800 0.0020 0.8440 0.1891 0.8952 2.7798 1.3195 10.0360 1.9107 5.4926 2.3829 5.4046 27.4676 3.6991 98.3869 4.0492 2.1209 17.1010 5.5420 1.5236 2.8629 36.6723 41.7540 21.7106 25.7612 16.2925 3.1852 2.0364 6.4299 1.8798 20.5667 6.3325 3.5593 6.0521 23.5688 12.5775 12.2355 1.5512 7.8153 15.3633 11.5794 121.8444 19.5077 82.4154 12.8681 1.5796 116.7351 4.7448 19.7418 7.2670 5.6591 6.2155 6.1004 5.5595 35.3823 21.4989 4.5286 46.6478 19.0561 3.4076 1.5964 0.6116 2.8374 30.0305 2.4945 16.5408 6.4206 5.8766 9.7097 4.8740 10.2521 4.8355 12.4508 19.3283 26.0193 52.9751 16.2190 14.9899 61.3568 110.9896 49.9531 83.4973 35.4842 45.6328 30.9707 59.5746 24.3372 21.1388 17.8346 21.9447 45.8000 15.2146 27.0268 32.6060 12.9253 1.6822 31.9380
temp: 298.150 k
press: 1.00000 atm
elementType: 8 8 7 6 6 6 6 6 6 6 6 6 6 6 6 6 1 1 1 1 1 1 1 1 1 1 1 1 1 1 1 1 1 1 1
symmnumber: 1
zpe: 779237.5 jmol-1
zpe.correction: 0.296796 hartree
zpe.thermalcorrener: 0.312990 hartree
zpe.thermalcorrenthalpy: 0.313935 hartree
zpe.thermalcorrgfe: 0.252846 hartree
zpe.sumelectzpe: -710.732898 hartree
zpe.sumelectthermal: -710.716703 hartree
zpe.sumelectthermalent: -710.715759 hartree
zpe.sumelectthermalfe: -710.776848 hartree
dipole: -0.1676 3.1643 0.4770
dipole: 3.2044
quadrupole: -88.6735 -90.7504 -100.5992
quadrupole: 0.5302 -7.0660 -5.9758
quadrupole: 4.6675 2.5906 -7.2582 0.5302 -7.0660 -5.9758
hfenergy: -711.0296935 hartree
pointgroup: C01 [X(C13H19N1O2)]
dipole: 0.0231491 -1.2534521 0.133228 debye
polarizability: 198.4291913|-14.2769248|153.4457846|13.9204425|11.2381815|110.5322555 unknown
InChI: InChI=1S/C13H19NO2/c1-9-6-13(15)10(2)5-11(9)7-12-8-16-4-3-14-12/h5-6,12,14-15H,3-4,7-8H2,1-2H3
charge 0 multiplicity 1
35 atoms
O  3.145689 1.356044 -1.184046
O  -4.503929 0.374032 -0.87427
N  3.228275 -0.785801 0.710286
C  1.924862 -0.378794 0.125263
C  0.796845 -0.634615 1.161126
C  2.02774 1.113147 -0.255295
C  -0.609219 -0.42307 0.616168
C  4.366399 -0.567028 -0.212784
C  4.416905 0.926811 -0.57575
C  -1.287955 -1.438733 -0.120823
C  -1.269061 0.813985 0.835607
C  -2.563063 1.102566 0.34825
C  -2.586324 -1.167339 -0.616602
C  -3.210504 0.079324 -0.390725
C  -0.665995 -2.804402 -0.367254
C  -3.251278 2.428472 0.593116
H  1.699128 -0.943683 -0.814077
H  0.979963 0.026796 2.028927
H  0.909345 -1.674781 1.530766
H  1.126157 1.452891 -0.788202
H  2.172482 1.712682 0.671257
H  3.198873 -1.743065 1.086703
H  4.276867 -1.155372 -1.158784
H  5.307563 -0.859493 0.289784
H  4.614582 1.523576 0.340812
H  5.191105 1.133296 -1.333315
H  -0.752191 1.588303 1.417131
H  -3.116102 -1.945497 -1.184114
H  -1.34336 -3.450053 -0.951923
H  0.287006 -2.729942 -0.923507
H  -0.445015 -3.327867 0.583086
H  -2.610972 3.104458 1.185132
H  -3.503603 2.928872 -0.359941
H  -4.20682 2.288433 1.131432
H  -4.870495 -0.394554 -1.377734
