program: Gaussian 09
title: 000108562
version: EM64L-G09RevD.01
frameworkgroup: C1[X(C18H29N3)]
method: RPBEPBE
basis: SDD
operation: Freq
keyword: #pfreq=noraman
keyword: PBEPBE/SDD
title: #p freq=noraman PBEPBE/SDD
converged: YES YES NO NO
title: Mulliken charges:
elementType: N N N C C C C C C C C C C C C C C C C C C H H H H H H H H H H H H H H H H H H H H H H H H H H H H H
charge: -0.044425 -0.029214 -0.039103 -0.463121 -0.451728 -0.379167 -0.371804 -0.339895 -0.338515 -0.349729 -0.347821 -0.355386 -0.356147 -0.123750 -0.691675 -0.691346 -0.214956 -0.285727 0.262573 -0.254420 -0.259244 0.224372 0.239232 0.226812 0.233058 0.232991 0.208936 0.214754 0.206102 0.199444 0.182088 0.206013 0.183355 0.194499 0.188613 0.191469 0.186170 0.193499 0.193397 0.198156 0.193756 0.239042 0.211300 0.213118 0.217352 0.209412 0.212547 0.219559 0.264069 0.241487
chargesum: 0.00000
title: Mulliken charges with hydrogens summed into heavy atoms:
elementType: N N N C C C C C C C C C C C C C C C C C C
charge: -0.044425 -0.029214 -0.039103 0.000483 0.008142 0.062759 0.049052 0.041637 0.050853 0.033383 0.029817 0.031510 0.035765 0.115292 -0.049906 -0.049828 0.049113 -0.044240 0.262573 -0.254420 -0.259244
polarizability: 2.39039166e+02 -6.56886693e+01 3.14833000e+02 -1.61009497e+01 2.21678368e-01 1.92617032e+02
1716.lowfreq: -0.9566 -0.0010 -0.0007 0.0006 5.5964 7.7354 14.2626 20.3743 26.8649
frequency: 13.3835 19.7192 26.8100 31.6742 49.1062 50.6603 56.2034 60.9174 69.0447 89.5387 97.8657 120.4186 122.6768 127.4581 130.8350 132.2988 145.9871 189.0469 197.2440 226.7923 231.6358 236.2909 252.9006 279.1053 314.3309 320.4815 341.4715 359.1029 376.7231 389.2872 437.7778 451.8885 471.4498 479.2399 502.1197 563.9968 591.3123 613.9910 630.6944 721.7471 726.2511 731.1264 752.0008 766.5401 808.2667 823.7782 837.4533 856.8482 869.7231 886.9193 889.5715 895.6036 900.2427 934.1931 966.9082 972.4196 984.7824 1012.1473 1025.6081 1028.9783 1070.1098 1078.0802 1078.4459 1081.9790 1100.0517 1116.5136 1122.9414 1123.3457 1152.9848 1157.5704 1197.5976 1203.5529 1216.7425 1231.0500 1249.7707 1251.5928 1259.0193 1268.2755 1275.3302 1284.9508 1289.4313 1290.8686 1293.5879 1294.5759 1312.0341 1312.9263 1321.0703 1337.8145 1345.8690 1353.2135 1354.7090 1361.8852 1364.4469 1368.2683 1389.9400 1390.7182 1409.7258 1453.9842 1457.3683 1463.7739 1464.1607 1469.2233 1469.6244 1469.7600 1477.2935 1477.7004 1478.5908 1479.9062 1487.4270 1488.1998 1491.0837 1572.2815 1636.5311 2148.7971 2162.9767 2949.1337 2951.1690 2955.8529 2957.8821 2966.7193 2967.4293 2970.3935 2973.9549 2974.2586 2980.4817 2990.7874 2991.9801 2992.9612 2996.9394 3005.5183 3006.3715 3024.0290 3030.1287 3040.3156 3045.6944 3062.3272 3069.6958 3070.3247 3071.0235 3073.6166 3074.9177 3109.1029 3111.3162 3144.2870
redmass: 4.6029 4.6990 6.4408 5.6064 1.7309 1.6088 3.4101 3.7431 4.4026 3.6152 3.4445 3.4130 3.8468 2.6415 1.8940 2.3640 3.2447 3.5571 3.5295 1.1333 1.1392 3.7247 2.7046 2.7660 2.9238 3.3630 3.1107 3.8724 3.4671 3.3012 3.3082 2.8916 7.3443 3.9611 2.3352 3.1008 12.4075 3.1658 6.9285 1.3641 1.0748 1.3230 1.2036 1.7528 2.8624 1.3772 1.5347 1.7286 1.7836 1.7876 1.9362 1.6256 1.3572 1.7494 1.4336 1.1874 1.3695 2.2824 3.4003 2.5765 2.1812 2.4173 2.4379 2.2339 2.1706 2.1243 2.0967 1.9806 2.4404 3.1344 1.5908 1.5342 1.3993 1.4330 1.4297 1.5210 1.2587 1.2550 1.2552 1.0737 1.0544 1.1857 1.1493 1.5666 1.4158 1.4702 1.3908 1.2917 1.4211 1.5527 1.5721 1.5611 1.5515 1.7119 1.2168 1.2165 2.0181 1.0820 1.0821 1.0711 1.0703 1.0805 1.0775 1.0757 1.0425 1.0457 1.0743 1.0718 1.0887 1.0868 1.1354 5.2580 4.5179 12.6128 12.6273 1.0596 1.0604 1.0596 1.0590 1.0600 1.0596 1.0599 1.0362 1.0361 1.0625 1.0805 1.0952 1.0778 1.0643 1.1003 1.0988 1.1033 1.1035 1.1042 1.1034 1.1021 1.1006 1.1007 1.1006 1.0994 1.0993 1.0913 1.0913 1.0890
irintensity: 0.9284 0.6645 1.0175 1.6200 0.2483 0.0745 0.0130 0.1244 0.9754 1.1481 0.3464 2.1529 1.6498 0.8768 0.1709 0.3044 2.2841 1.7879 1.3928 0.0054 0.0308 0.5480 0.7155 0.2287 0.6985 0.3002 0.4108 1.8438 0.4320 0.0714 2.7281 0.1365 0.3079 1.9762 0.7718 8.5852 1.2060 2.8867 0.2420 10.9497 6.9859 6.1286 0.0505 0.4099 10.9593 0.5503 28.2264 17.3832 3.7471 2.2061 1.0229 1.1629 1.9439 4.7524 7.1727 66.1086 3.5062 7.1868 1.6488 11.6133 7.4554 4.8086 4.7989 2.7665 45.6828 1.1647 21.4259 3.2486 29.7200 1.8965 14.4402 2.4372 35.3695 3.9781 28.9086 31.9977 15.0287 0.2107 18.2353 1.9982 1.1274 8.9690 3.8139 35.6906 32.2445 2.0115 19.7558 7.6247 75.3999 16.8199 1.4234 13.4404 36.9516 3.1108 12.5131 12.0778 215.7189 2.8336 3.4725 1.2988 0.6219 15.8509 9.7884 1.5396 12.7059 12.3457 4.7143 4.4285 15.0413 22.3347 3.9968 65.7076 1160.0884 50.9161 169.1806 12.6805 4.8526 8.1817 1.0204 4.8959 79.0067 104.0176 52.6129 27.3720 26.1321 22.3920 4.7739 41.5926 31.1990 1.2227 3.9333 1.6250 17.5869 106.5808 76.0515 2.0367 8.0104 105.7486 113.0771 51.9108 49.8068 4.7460 6.0929 11.5172
temp: 298.150 k
press: 1.00000 atm
elementType: 7 7 7 6 6 6 6 6 6 6 6 6 6 6 6 6 6 6 6 6 6 1 1 1 1 1 1 1 1 1 1 1 1 1 1 1 1 1 1 1 1 1 1 1 1 1 1 1 1 1
symmnumber: 1
zpe: 1137713.7 jmol-1
zpe.correction: 0.433332 hartree
zpe.thermalcorrener: 0.459029 hartree
zpe.thermalcorrenthalpy: 0.459973 hartree
zpe.thermalcorrgfe: 0.372818 hartree
zpe.sumelectzpe: -865.880352 hartree
zpe.sumelectthermal: -865.854655 hartree
zpe.sumelectthermalent: -865.853711 hartree
zpe.sumelectthermalfe: -865.940866 hartree
dipole: 6.5742 -10.4740 -2.4280
dipole: 12.6024
quadrupole: -142.1298 -178.1831 -135.7695
quadrupole: 27.3701 2.5899 -2.0009
quadrupole: 9.8976 -26.1556 16.2580 27.3701 2.5899 -2.0009
hfenergy: -866.3136847 hartree
pointgroup: C01 [X(C18H29N3)]
dipole: -0.6339889 4.8536102 -0.7898434 debye
polarizability: 201.8659514|-15.2515581|351.6159979|14.2392127|-1.2733905|193.0072491 unknown
InChI: InChI=1S/C18H29N3/c1-3-5-7-9-13-21(14-10-8-6-4-2)15-11-12-18(16-19)17-20/h11-12,15H,3-10,13-14H2,1-2H3
charge 0 multiplicity 1
50 atoms
N  -0.083093 0.651682 -0.480825
N  0.091489 -6.56273 -1.58274
N  1.138996 -4.378287 2.260765
C  0.334926 0.953102 0.912239
C  -0.505588 1.762917 -1.376707
C  1.870422 0.943827 1.118027
C  -2.040488 1.896424 -1.521811
C  2.617585 2.043654 0.331897
C  -2.780466 2.243527 -0.21127
C  4.145887 2.0089 0.559056
C  -4.305234 2.397991 -0.410121
C  4.901491 3.111835 -0.217109
C  -5.057596 2.746751 0.894537
C  -0.124545 -0.63175 -0.947712
C  6.428975 3.060748 0.000973
C  -6.579813 2.898654 0.687192
C  0.181377 -1.798691 -0.243674
C  0.078383 -3.075758 -0.864895
C  0.353361 -4.307925 -0.251424
C  0.212395 -5.538173 -0.971678
C  0.782032 -4.370354 1.115981
H  -0.069325 1.947234 1.173847
H  -0.141756 0.21988 1.590917
H  -0.082617 2.699611 -0.972708
H  -0.050693 1.603752 -2.373803
H  2.275052 -0.049004 0.842165
H  2.061804 1.069599 2.203005
H  -2.449428 0.953632 -1.938603
H  -2.238889 2.684412 -2.277307
H  2.413138 1.929012 -0.752547
H  2.22718 3.041395 0.626505
H  -2.592764 1.452917 0.543301
H  -2.369748 3.187223 0.206784
H  4.538349 1.015425 0.258284
H  4.360759 2.112078 1.643121
H  -4.717909 1.456495 -0.828805
H  -4.500772 3.18688 -1.166425
H  4.678962 3.013408 -1.299488
H  4.515133 4.105053 0.091225
H  -4.863093 1.957988 1.649559
H  -4.644765 3.687354 1.313449
H  -0.436406 -0.722963 -1.997284
H  6.681965 3.183464 1.070956
H  6.844283 2.090902 -0.331656
H  6.945267 3.859857 -0.56173
H  -6.803002 3.697929 -0.044578
H  -7.024087 1.96044 0.305022
H  -7.092745 3.153699 1.632361
H  0.505079 -1.757245 0.801878
H  -0.243969 -3.114569 -1.915141
