program: Gaussian 09
title: 000108561
version: EM64L-G09RevD.01
frameworkgroup: C1[X(C14H11N3O)]
method: RPBEPBE
basis: SDD
operation: Freq
keyword: #p
keyword: freq=noraman
keyword: PBEPBE/SDD
title: #p freq=noraman PBEPBE/SDD
converged: YES YES NO NO
title: Mulliken charges:
elementType: O N N N C C C C C C C C C C C C C C H H H H H H H H H H H
charge: -0.240377 -0.274651 -0.006662 -0.015750 0.358419 -0.346564 -0.347061 0.232315 -0.132722 -0.201710 -0.201772 -0.225496 -0.778265 -0.195920 -0.263702 0.278779 -0.242694 -0.249927 0.263032 0.262824 0.287798 0.240545 0.240506 0.241016 0.267594 0.257913 0.257956 0.278083 0.256490
chargesum: 0.00000
title: Mulliken charges with hydrogens summed into heavy atoms:
elementType: O N N N C C C C C C C C C C C C C C
charge: -0.240377 -0.274651 -0.006662 -0.015750 0.358419 -0.083531 -0.084237 0.232315 0.155076 0.038835 0.038734 0.015520 0.005199 0.082163 -0.007213 0.278779 -0.242694 -0.249927
polarizability: 2.92945512e+02 -1.72603061e+01 2.00818986e+02 -1.84636179e-01 9.52326910e-03 1.10759256e+02
1716.lowfreq: -14.2682 -8.5391 -7.4831 -0.0004 0.0004 0.0005 15.1485 29.1533 36.9648
frequency: 10.9212 29.1270 36.9430 55.7061 71.9179 83.5652 89.2908 115.1388 135.6770 140.2206 233.2185 236.5479 251.4060 284.1571 300.4820 351.6635 375.3741 405.8972 438.8775 452.2015 469.6465 485.6411 540.8685 583.9625 590.1688 597.9650 617.6452 620.2225 643.6986 699.2587 720.1748 773.3335 809.6997 851.7132 896.2133 921.9504 925.1145 949.0456 980.6789 985.5755 991.7698 1000.5771 1004.8072 1023.0290 1031.9969 1078.4165 1124.3572 1157.0302 1176.8315 1181.7323 1205.5468 1251.4934 1273.9129 1295.7399 1309.5949 1331.4340 1356.9542 1378.7535 1385.9754 1438.3161 1445.1716 1455.8528 1480.7338 1562.4114 1595.4078 1603.4556 1612.9277 1637.5539 2160.0588 2171.5896 3002.8838 3086.0295 3124.2977 3137.5773 3137.9595 3139.8332 3141.7510 3145.2725 3152.2498 3161.9042 3175.9920
redmass: 2.6578 9.6589 7.4628 2.8839 2.8183 6.1994 1.8902 11.2891 5.2986 6.7661 8.0221 5.7400 2.0430 5.5664 4.8431 4.2515 4.9484 2.8353 7.0646 6.3252 4.1647 5.2413 4.8863 3.7644 11.6215 3.9869 5.3803 5.9459 6.7875 2.2731 3.0616 2.1781 4.4647 1.2469 1.6668 1.4210 1.5299 3.8322 1.3825 2.3816 3.5782 1.1404 1.3528 2.1031 1.6734 1.5356 3.7604 2.7432 1.0560 1.1531 2.7379 2.2898 2.1730 1.7594 1.3333 3.0115 1.8093 9.3802 1.2263 2.1392 1.0733 1.0580 2.4208 6.6408 6.4772 6.1174 6.6231 6.2372 12.6182 12.6332 1.0378 1.0967 1.0927 1.0909 1.0907 1.0999 1.0888 1.0855 1.0929 1.0971 1.1018
irintensity: 0.1086 1.0545 2.6991 0.0041 7.0938 0.7403 1.0650 1.5174 2.8061 2.6794 1.9803 3.6826 2.2641 0.8144 1.1370 0.0085 2.6661 0.0003 5.3291 0.1222 0.2092 0.3338 27.8654 3.2417 2.5881 29.1363 5.2644 0.6040 0.2632 46.9811 8.0719 6.1382 3.0651 0.3095 5.5289 0.2057 14.8212 1.9256 0.3441 75.0339 38.3944 64.6747 3.6592 11.0624 3.7357 11.7733 33.6939 9.4052 0.0002 0.3549 570.4589 140.5576 152.8119 180.1612 0.0418 284.8155 0.5666 2.1304 62.8199 3.8526 31.8918 29.0308 65.1324 5.0657 3.9087 82.0529 582.3648 226.1392 19.0555 87.7250 1.8626 5.5691 2.0592 4.0142 0.9591 11.7777 0.4373 21.9111 9.6763 15.3626 11.6102
temp: 298.150 k
press: 1.00000 atm
elementType: 8 7 7 7 6 6 6 6 6 6 6 6 6 6 6 6 6 6 1 1 1 1 1 1 1 1 1 1 1
symmnumber: 1
zpe: 561587.5 jmol-1
zpe.correction: 0.213897 hartree
zpe.thermalcorrener: 0.231210 hartree
zpe.thermalcorrenthalpy: 0.232154 hartree
zpe.thermalcorrgfe: 0.165176 hartree
zpe.sumelectzpe: -778.275353 hartree
zpe.sumelectthermal: -778.258041 hartree
zpe.sumelectthermalent: -778.257096 hartree
zpe.sumelectthermalfe: -778.324074 hartree
dipole: 9.3816 0.9970 0.0068
dipole: 9.4344
quadrupole: -134.1412 -116.7500 -97.4272
quadrupole: 11.5898 -0.0683 0.0235
quadrupole: -18.0351 -0.6439 18.6789 11.5898 -0.0683 0.0235
hfenergy: -778.4892503 hartree
pointgroup: C01 [X(C14H11N3O1)]
dipole: -3.681509 0.4730595 -0.0047869 debye
polarizability: 293.657641|15.2255953|200.1057681|0.0611616|0.3377135|110.7603445 unknown
InChI: InChI=1S/C14H11N3O/c1-12(18)17(14-7-3-2-4-8-14)9-5-6-13(10-15)11-16/h2-9H,1H3
charge 0 multiplicity 1
29 atoms
O  -1.991496 -3.412166 -0.018713
N  -1.437597 -1.137734 -0.010184
N  5.876126 -1.106568 -0.001748
N  3.148678 2.493983 0.011742
C  -1.867171 0.254279 -0.005617
C  -2.051591 0.931925 -1.232196
C  -2.070067 0.918296 1.225481
C  -2.392322 -2.219109 -0.015717
C  -0.077003 -1.448455 -0.009914
C  -2.459686 2.284451 -1.224114
C  -2.478124 2.270859 1.226265
C  -2.675602 2.953752 0.003263
C  -3.856092 -1.825659 -0.017632
C  0.953906 -0.529362 -0.004264
C  2.319906 -0.967849 -0.004983
C  3.432625 -0.125605 0.000052
C  4.765345 -0.658989 -0.000979
C  3.291634 1.304943 0.006499
H  -1.869437 0.405883 -2.175621
H  -1.901618 0.381988 2.165675
H  0.111881 -2.528583 -0.014526
H  -2.601254 2.814545 -2.171597
H  -2.633925 2.790482 2.177315
H  -2.987181 4.003455 0.006727
H  -4.457306 -2.745662 -0.02958
H  -4.108625 -1.210218 -0.899039
H  -4.115909 -1.229454 0.874821
H  0.745908 0.546675 0.000868
H  2.5146 -2.048701 -0.009884
