program: Gaussian 09
title: 000108556
version: EM64L-G09RevD.01
frameworkgroup: C1[X(C9H16O2)]
method: RPBEPBE
basis: SDD
operation: Freq
keyword: #pfreq=noraman
keyword: PBEPBE/SDD
title: #p freq=noraman PBEPBE/SDD
converged: YES YES NO NO
title: Mulliken charges:
elementType: O O C C C C C C C C C H H H H H H H H H H H H H H H H
charge: -0.255020 -0.276925 0.100120 -0.236122 -0.398013 -0.485443 -0.693681 -0.224309 -0.672058 0.208091 -0.506341 0.153863 0.173337 0.219133 0.232572 0.224981 0.222516 0.227100 0.245519 0.205100 0.224966 0.191461 0.185039 0.202825 0.224365 0.233001 0.273924
chargesum: 0.00000
title: Mulliken charges with hydrogens summed into heavy atoms:
elementType: O O C C C C C C C C C
charge: -0.255020 -0.276925 0.253983 0.156347 0.059540 -0.035828 -0.018096 0.152190 -0.011867 0.208091 -0.232417
polarizability: 1.42478131e+02 -4.46601999e+00 9.36013561e+01 7.28452458e+00 -1.95178848e+00 7.87539669e+01
1716.lowfreq: -5.9958 -0.0010 -0.0008 0.0004 0.7849 5.8851 22.7758 35.0218 55.8239
frequency: 21.8762 34.9263 55.5317 69.6171 82.7978 89.5730 148.2825 165.0527 189.5927 220.4062 242.2358 264.2016 289.5525 326.5129 355.1912 449.7248 474.5713 522.9166 551.8825 636.3623 640.4853 754.9216 788.7248 817.9983 849.3351 856.9097 914.3377 939.8791 1001.0117 1036.1775 1042.8093 1064.8881 1077.4250 1087.9460 1106.0003 1119.6546 1135.4737 1148.9295 1164.8253 1252.1160 1256.6857 1259.1144 1274.5981 1317.1875 1324.0295 1340.1415 1377.0532 1384.2142 1394.1010 1400.4527 1457.1024 1459.5224 1461.9095 1465.5197 1475.6065 1479.4728 1491.0459 1493.4707 2142.3558 2861.5360 2918.2421 2921.7428 2968.3604 2970.6165 2994.5845 2999.8978 3013.3107 3015.3123 3020.0880 3085.5671 3092.1129 3097.3032 3101.8064 3114.4670 3428.0803
redmass: 2.8473 3.0178 1.9070 2.3848 3.9680 2.3879 3.1253 3.7939 1.3223 1.8783 1.2217 3.2156 4.6355 3.0647 3.6156 3.5939 4.1407 3.2634 4.2033 1.2289 1.2243 1.1127 2.5885 1.1061 2.7115 1.2751 2.7996 4.1841 4.7735 3.7018 3.3902 2.2474 2.5041 1.5666 2.2671 2.5691 1.4649 2.2157 1.2075 1.1543 1.2750 1.2101 1.0734 1.2229 1.2034 1.4351 1.3400 1.2764 1.3475 1.3260 1.0449 1.0409 1.0828 1.0502 1.0805 1.0516 1.0852 1.0800 6.0482 1.0832 1.0625 1.0589 1.0583 1.1048 1.0359 1.0356 1.0903 1.0963 1.0678 1.1050 1.0992 1.0998 1.1009 1.1003 1.1586
irintensity: 0.1633 1.2885 2.1602 0.0853 0.2317 0.2418 9.2868 1.8775 0.5800 1.5430 0.2649 1.4786 1.7460 7.6821 3.0508 7.1976 9.6324 0.7999 6.9827 76.8558 78.5341 6.7705 33.2778 3.4999 22.2171 0.0429 76.3408 34.4323 68.5805 1.2242 117.2163 94.4840 3.2811 0.4408 63.1333 75.3411 12.9482 27.7440 13.5720 0.7119 2.2365 3.5996 0.8852 35.7846 39.2921 17.7484 0.9358 28.4638 17.2553 18.4618 8.5877 10.3470 3.1130 3.1838 6.6610 3.2719 10.3571 5.0599 13.0131 68.1715 20.6946 125.6226 23.4516 62.9820 25.3775 17.4259 22.4156 1.1764 32.3472 39.1117 38.1652 30.6819 37.5493 20.6796 67.7303
temp: 298.150 k
press: 1.00000 atm
elementType: 8 8 6 6 6 6 6 6 6 6 6 1 1 1 1 1 1 1 1 1 1 1 1 1 1 1 1
symmnumber: 1
zpe: 603200.6 jmol-1
zpe.correction: 0.229747 hartree
zpe.thermalcorrener: 0.244101 hartree
zpe.thermalcorrenthalpy: 0.245045 hartree
zpe.thermalcorrgfe: 0.186412 hartree
zpe.sumelectzpe: -502.016581 hartree
zpe.sumelectthermal: -502.002227 hartree
zpe.sumelectthermalent: -502.001283 hartree
zpe.sumelectthermalfe: -502.059916 hartree
dipole: 2.0722 -0.8997 2.2317
dipole: 3.1755
quadrupole: -62.9177 -67.7962 -68.2030
quadrupole: -0.6850 3.7075 -0.0498
quadrupole: 3.3880 -1.4906 -1.8974 -0.6850 3.7075 -0.0498
hfenergy: -502.2463281 hartree
pointgroup: C01 [X(C9H16O2)]
dipole: 0.8320585 -0.2911983 0.8853016 debye
polarizability: 142.7926428|-3.1961942|93.2158139|6.7532634|-2.5598567|78.8249971 unknown
InChI: InChI=1S/C9H16O2/c1-4-6-7-8-11-9(3)10-5-2/h1,9H,5-8H2,2-3H3
charge 0 multiplicity 1
27 atoms
O  0.481936 1.16299 -0.179289
O  2.41005 -0.180325 -0.410552
C  1.873848 1.065312 0.178532
C  -0.350749 0.079462 0.374921
C  -1.787632 0.337373 -0.087163
C  -2.753691 -0.761699 0.437375
C  2.57355 2.298181 -0.387065
C  3.517152 -0.774133 0.356598
C  3.881135 -2.097256 -0.317375
C  -4.151185 -0.545868 0.021895
C  -5.319977 -0.361914 -0.327174
H  1.98186 0.990934 1.291237
H  -0.281515 0.089872 1.487427
H  0.024854 -0.895756 0.007677
H  -1.813654 0.36168 -1.191083
H  -2.120162 1.329117 0.26835
H  -2.706838 -0.799431 1.544736
H  -2.416239 -1.753612 0.074727
H  2.42067 2.330401 -1.478348
H  3.657216 2.257261 -0.179153
H  2.158922 3.218167 0.059782
H  4.392098 -0.087941 0.364576
H  3.200868 -0.93733 1.41182
H  4.715291 -2.587462 0.217276
H  3.015035 -2.781517 -0.321415
H  4.187206 -1.924057 -1.363244
H  -6.337049 -0.200248 -0.633569
