program: Gaussian 09
title: 000108522
version: EM64L-G09RevD.01
frameworkgroup: C1[X(C12H15N2S)]
method: RPBEPBE
basis: SDD
operation: Freq
keyword: #p
keyword: freq=noraman
keyword: PBEPBE/SDD
title: #p freq=noraman PBEPBE/SDD
converged: YES YES NO NO
title: Mulliken charges:
elementType: S N N C C C C C C C C C C C C H H H H H H H H H H H H H H H
charge: 0.262891 -0.126782 -0.395448 -0.315771 -0.665810 0.078794 -0.631660 -0.310818 -0.045681 0.515331 -0.414328 -0.346664 -0.183724 -0.206395 -0.229970 0.276572 0.263732 0.314070 0.301401 0.264452 0.257583 0.264655 0.259956 0.249413 0.330915 0.237692 0.235388 0.253400 0.249941 0.256866
chargesum: 1.00000
title: Mulliken charges with hydrogens summed into heavy atoms:
elementType: S N N C C C C C C C C C C C C
charge: 0.262891 -0.126782 -0.064533 0.224534 -0.050340 0.078794 0.155030 -0.050863 0.203732 0.515331 -0.176637 -0.111276 0.069676 0.043546 0.026896
polarizability: 3.68869062e+02 -3.02765708e+00 1.55989206e+02 -4.52864332e+00 -6.32232653e+00 7.66965370e+01
1716.lowfreq: -9.9817 -2.3558 0.0020 0.0020 0.0020 5.5581 21.9541 42.1510 52.5719
frequency: 21.0501 42.0756 52.5524 89.5704 109.7537 138.4218 148.6960 187.2683 204.6259 216.2255 254.5668 295.3872 357.1454 390.7388 400.8185 465.1392 499.5484 519.2696 546.2088 570.0620 586.2046 613.1261 640.7922 686.8165 694.0405 731.7347 774.3036 822.2750 824.8876 837.5412 840.9442 913.1398 920.2655 967.5660 976.3939 986.7600 1005.6268 1010.1877 1012.1535 1025.7994 1076.1187 1095.5359 1102.6153 1157.8411 1183.6736 1194.5167 1198.9158 1203.4260 1220.1231 1254.7071 1273.4735 1306.7026 1311.4483 1327.1037 1339.6911 1372.2251 1389.0373 1424.4892 1443.2745 1453.9396 1464.3706 1471.2694 1479.2114 1485.2946 1498.5018 1574.8065 1602.6419 1608.5385 1647.8646 2990.3618 2995.9027 3066.8421 3082.3178 3083.7536 3126.0215 3127.7944 3137.3453 3144.1472 3155.7163 3157.0793 3158.7696 3168.0369 3183.8377 3486.9536
redmass: 3.8203 4.3455 5.0322 1.5895 1.9473 3.7534 2.5039 2.6174 2.4361 3.8477 3.7153 3.6052 3.6249 4.2529 2.8000 6.9445 3.0173 4.2695 4.5174 5.7181 5.2434 6.3926 4.3555 1.8555 4.0149 1.4074 1.6646 1.8284 1.3921 1.6847 3.8533 1.4259 2.3188 1.2096 1.3862 5.5359 1.3401 2.8555 1.4232 2.2331 1.9948 1.5974 1.2621 1.3512 1.0650 1.3444 1.7360 1.6243 2.2872 1.7386 1.3133 1.8396 1.4908 1.3600 1.5935 2.1105 4.0993 1.6605 1.4993 1.1027 1.2243 1.1732 1.0580 2.1667 1.4650 4.2240 5.7356 5.2816 3.9302 1.0399 1.0619 1.0634 1.1004 1.0961 1.0905 1.0998 1.0918 1.0881 1.0903 1.1099 1.0905 1.0959 1.1015 1.0761
irintensity: 0.1729 1.3859 0.2437 2.1056 0.4101 0.7092 1.5056 1.7617 2.7191 1.9783 7.8815 2.7077 0.3084 3.3565 0.0380 2.8771 17.7320 2.6350 1.0156 10.3522 6.5016 0.0843 19.5237 34.1640 6.1789 1.7767 93.2572 34.8382 7.8468 63.2393 8.5378 2.7875 15.2572 76.9397 1.4210 6.5268 1.0845 2.3700 8.3476 0.8741 10.6015 9.0947 7.8312 1.1903 0.9054 3.1209 3.7896 25.2558 7.4710 59.5363 80.9974 19.2107 25.5200 268.4226 181.2621 5.1932 3.7130 37.2680 17.6933 13.1812 5.0575 7.2709 40.0074 50.4640 44.3557 309.0473 137.5006 80.9589 984.5230 16.9462 37.6591 2.9696 8.2956 11.7992 6.7378 4.4120 1.6359 5.4034 0.4927 1.5263 0.5170 11.0483 9.5422 79.3096
temp: 298.150 k
press: 1.00000 atm
elementType: 16 7 7 6 6 6 6 6 6 6 6 6 6 6 6 1 1 1 1 1 1 1 1 1 1 1 1 1 1 1
symmnumber: 1
zpe: 649607.7 jmol-1
zpe.correction: 0.247422 hartree
zpe.thermalcorrener: 0.262069 hartree
zpe.thermalcorrenthalpy: 0.263013 hartree
zpe.thermalcorrgfe: 0.203824 hartree
zpe.sumelectzpe: -972.520627 hartree
zpe.sumelectthermal: -972.505981 hartree
zpe.sumelectthermalent: -972.505036 hartree
zpe.sumelectthermalfe: -972.564225 hartree
dipole: -5.4331 2.7417 0.4497
dipole: 6.1022
quadrupole: -12.0650 -72.0254 -98.8095
quadrupole: -1.3586 -2.4742 -2.4827
quadrupole: 48.9016 -11.0588 -37.8429 -1.3586 -2.4742 -2.4827
hfenergy: -972.7680492 hartree
pointgroup: C01[X(C12H15N2S1)]
dipole: 2.1712807 -1.013251 0.1507289 debye
polarizability: 368.8503863|2.8830407|156.383572|-5.1735946|2.9337467|76.3208472 unknown
InChI: InChI=1S/C12H15N2S/c1-14-9-10-15-12(14)7-8-13-11-5-3-2-4-6-11/h2-8,13H,9-10H2,1H3
charge 1 multiplicity 1
30 atoms
S  2.554916 1.747282 -0.616757
N  3.77895 -0.546807 -0.088621
N  -1.104499 -0.859745 -0.07667
C  4.905591 0.371476 -0.430554
C  4.408684 1.803167 -0.174188
C  2.527308 -0.02851 -0.226389
C  4.038923 -1.976519 0.178961
C  1.32925 -0.77406 -0.112191
C  0.06228 -0.174585 -0.112783
C  -2.433047 -0.321672 -0.012614
C  -3.508651 -1.213127 -0.253101
C  -2.68211 1.04041 0.290316
C  -4.834788 -0.737757 -0.203848
C  -4.012933 1.503942 0.328592
C  -5.092388 0.622673 0.081929
H  5.188109 0.224594 -1.491433
H  5.776795 0.137571 0.203793
H  4.493129 2.104045 0.879972
H  4.888437 2.542451 -0.829816
H  3.449463 -2.318535 1.046549
H  5.104629 -2.109313 0.417013
H  3.795483 -2.602523 -0.699708
H  1.404655 -1.8643 -0.030353
H  -0.025744 0.916337 -0.145205
H  -1.056003 -1.884697 -0.109277
H  -3.314263 -2.267256 -0.487702
H  -1.869125 1.736945 0.518916
H  -5.663313 -1.427452 -0.39136
H  -4.208347 2.554561 0.565103
H  -6.121791 0.991309 0.119727
