program: Gaussian 09
title: 000108489
version: EM64L-G09RevD.01
frameworkgroup: C1[X(C7H11BrN2O4)]
method: RPBEPBE
basis: SDD
operation: Freq
keyword: #p
keyword: freq=noraman
keyword: PBEPBE/SDD
title: #p freq=noraman PBEPBE/SDD
converged: YES YES NO NO
title: Mulliken charges:
elementType: Br O O O O N N C C C C C C C H H H H H H H H H H H
charge: -0.024943 -0.261763 -0.286225 -0.451855 -0.207030 -0.361813 -0.379269 -0.455882 -0.554981 0.327416 0.230663 -0.386005 -0.632023 0.185406 0.267351 0.264615 0.293343 0.361062 0.365403 0.286727 0.283702 0.227583 0.236919 0.271679 0.399921
chargesum: 0.00000
title: Mulliken charges with hydrogens summed into heavy atoms:
elementType: Br O O O O N N C C C C C C C
charge: -0.024943 -0.261763 -0.286225 -0.051934 -0.207030 -0.000752 -0.013866 0.076084 -0.261637 0.327416 0.230663 0.184423 0.104157 0.185406
polarizability: 1.54539001e+02 6.68261422e-01 1.13980293e+02 -1.41914960e+00 -3.89097795e+00 8.68730446e+01
1716.lowfreq: -3.7179 -0.0004 -0.0004 0.0004 3.2464 9.6091 15.2248 22.0826 42.4248
frequency: 15.2169 22.0428 42.4241 49.6413 52.7948 81.0473 93.2664 132.9886 177.9365 194.0343 214.0205 225.9587 252.7805 269.5489 294.6483 325.2782 437.9134 491.6364 503.4504 543.4467 558.5399 561.3585 624.6306 627.0864 654.0340 681.5912 693.8800 728.4052 815.5010 897.3721 950.8059 977.8876 984.0068 988.4835 1058.0378 1062.8375 1078.5401 1105.9756 1138.5571 1185.0123 1203.0962 1216.5683 1218.2269 1230.5248 1299.4410 1308.5098 1329.4151 1349.3414 1393.9425 1455.3848 1459.1855 1460.8763 1470.9955 1475.1293 1502.2011 1603.0472 1626.8425 1689.7451 2973.8633 2990.6936 2996.3508 3016.2863 3036.2810 3061.8890 3088.6915 3129.3099 3456.8249 3535.0108 3539.4679
redmass: 7.6326 6.3017 7.4145 5.5516 5.8250 6.2482 6.0456 4.7101 2.6419 4.2689 2.8308 1.2940 4.9411 3.4605 8.1193 5.9740 5.5611 1.8895 4.8979 4.1371 3.0775 3.6981 1.9384 1.7668 1.4423 1.3569 3.3738 4.0589 4.8460 4.5720 3.6685 1.9722 1.5313 2.0829 2.5342 1.9938 2.0404 3.1184 2.3574 1.5780 1.0981 1.0825 1.6339 1.7223 1.8158 1.7026 1.5659 1.8882 1.2138 1.0446 1.0799 1.0645 1.1195 2.2048 2.2350 9.3660 6.3924 9.3570 1.0592 1.0401 1.0602 1.1009 1.0998 1.0873 1.0932 1.1015 1.0781 1.0647 1.0784
irintensity: 0.1353 0.5752 6.2678 0.6335 3.3682 7.4835 1.6254 10.1359 7.0390 3.3240 5.5277 1.0784 6.5200 14.8279 8.7310 9.2611 24.3389 41.8464 25.6493 53.3977 1.4406 3.4025 11.8500 14.9439 227.6607 97.8930 17.1664 3.1490 14.3622 23.5843 45.9639 0.9459 24.9427 1.3042 16.7156 11.6182 239.8291 9.3529 13.5739 17.5081 0.5400 0.3215 6.2360 16.4159 21.6695 45.0851 13.5659 7.2683 33.4268 21.0482 14.7510 2.7629 19.1903 706.2486 147.5604 256.6132 95.9477 260.5225 29.5627 11.6396 20.2682 12.8107 3.8164 8.7995 17.4164 9.4942 134.8422 27.1107 100.7837
temp: 298.150 k
press: 1.00000 atm
elementType: 35 8 8 8 8 7 7 6 6 6 6 6 6 6 1 1 1 1 1 1 1 1 1 1 1
symmnumber: 1
zpe: 489929.2 jmol-1
zpe.correction: 0.186604 hartree
zpe.thermalcorrener: 0.202577 hartree
zpe.thermalcorrenthalpy: 0.203521 hartree
zpe.thermalcorrgfe: 0.138425 hartree
zpe.sumelectzpe: -696.153741 hartree
zpe.sumelectthermal: -696.137769 hartree
zpe.sumelectthermalent: -696.136824 hartree
zpe.sumelectthermalfe: -696.201920 hartree
dipole: 3.6758 2.0732 0.4144
dipole: 4.2405
quadrupole: -89.2861 -98.7160 -89.8092
quadrupole: 12.9086 -16.6065 4.0574
quadrupole: 3.3176 -6.1122 2.7946 12.9086 -16.6065 4.0574
hfenergy: -696.3403453 hartree
pointgroup: C01 [X(C7H11Br1N2O4)]
dipole: 1.3073634 0.5244659 -0.8939136 debye
dipolederiv: -0.25365 -0.0189256 0.0504226 -0.0493014 -0.368515 0.2574015 0.0897296 0.2152011 -0.395033 -0.743531 -0.0374446 0.0860934 -0.1519509 -0.3823625 -0.2110456 -0.3581289 -0.1488843 -0.8457865 -0.9048005 -0.0396043 0.0064958 0.123909 -0.4196519 -0.1897106 0.3520816 -0.1869804 -0.7864791 -0.411003 -0.017205 -0.0211746 -0.0503101 -0.552207 -0.2930683 -0.1167192 -0.2915678 -1.1043119 -1.0889387 -0.1241747 -0.2515867 -0.0243293 -0.3648661 -0.1134192 -0.0532803 -0.1138595 -0.5775382 -1.2605119 -0.2094075 -0.1493366 -0.2640274 -0.4535668 -0.055018 -0.4073953 -0.0760167 -0.459513 -1.4292495 0.0136621 0.1818079 0.0822966 -0.4318082 0.0003861 0.2574684 -0.0035189 -0.4486553 0.2323525 -0.0521164 -0.1514443 -0.1419645 0.2760109 -0.1296034 -0.3937704 -0.1546882 0.0376852 0.1063773 -0.0420347 0.1143484 0.0416196 0.5795491 -0.4190586 0.0669537 -0.3662948 0.3629778 1.4768612 0.343683 0.0113195 0.3259981 0.1891009 0.3869862 0.4420521 0.2661364 0.9825993 1.7556228 0.020086 -0.1732865 -0.1328342 0.3026205 0.2979721 -0.4402251 0.3126067 0.9123654 0.2583358 0.1004458 0.2041933 0.2013477 0.2629243 -0.0822756 0.4668036 -0.0696291 0.0845527 -0.1072574 -0.0059393 -0.0473817 0.0663098 -0.0850016 0.12324 -0.0608174 0.0878812 -0.1031902 1.4671037 0.0796203 0.1392848 0.0158409 0.4208228 0.4746644 0.0375993 0.4723344 1.3178871 -0.0454642 0.0069689 -0.0003245 0.0888739 -0.0563043 -0.0311166 0.0624957 -0.0181475 0.0746082 -0.0293571 -0.0291654 0.0073114 -0.023019 0.0358836 0.0735932 0.1036985 0.0752488 -0.0231375 0.0068285 -0.067596 -0.0335672 -0.0362205 -0.0966817 -0.0286556 -0.0006529 0.0092519 -0.0427108 0.3956939 0.0298709 0.0081347 0.1108567 0.304449 -0.0213964 0.2152664 0.0020507 0.1973163 0.3142027 -0.0126556 -0.041417 -0.0511655 0.3057751 -0.0496271 -0.1162451 -0.0547617 0.2104802 0.0112138 -0.0037686 0.0054429 -0.0090314 0.0678196 0.0649002 -0.1083666 0.0558252 0.026413 0.0013528 -0.0001469 0.0021592 -0.0739234 -0.024429 -0.0225897 -0.0816639 -0.0175936 0.1086263 0.0873078 0.0030192 -0.0381072 -0.0240841 -0.0442152 0.0986933 -0.0219187 0.1267279 0.0197797 -0.0729153 0.0330405 0.0738086 0.018131 0.1187445 -0.0204045 0.1228208 -0.0208664 0.0250228 0.1377741 0.0175499 -0.0124645 -0.0383119 0.0102455 -0.0889498 -0.0444557 -0.0769285 0.062093 0.0956518 0.012238 0.029268 -0.0047096 0.4056636 -0.0218979 -0.01333 -0.0235269 0.3639485 unknown
polarizability: 153.2266816|7.0371631|87.330912|-4.60204|-3.3475931|114.8347449 unknown
InChI: InChI=1S/C7H11BrN2O4/c1-4(8)7(14)10-2-5(11)9-3-6(12)13/h4,9-10,12H,2-3H2,1H3
charge 0 multiplicity 1
25 atoms
Br -4.25959 -1.431688 1.55992
O  -2.887569 -0.583853 -1.781839
O  0.569944 0.835297 1.404707
O  4.357644 -0.302159 -1.406858
O  5.68014 0.457694 0.353009
N  -1.605357 0.197845 -0.014973
N  2.067161 0.197218 -0.248437
C  -0.342223 -0.055147 -0.697763
C  -4.047693 0.161302 0.262222
C  -2.806926 -0.118615 -0.602797
C  0.797292 0.365747 0.244364
C  3.234263 0.550878 0.562464
C  -5.322045 0.321952 -0.557722
C  4.551759 0.24976 -0.129143
H  -0.251736 -1.127209 -0.966287
H  -0.292929 0.510375 -1.649338
H  -3.878157 1.002869 0.95486
H  -1.520316 0.538346 0.95183
H  2.238696 -0.188587 -1.180216
H  3.219953 0.011173 1.529112
H  3.223176 1.626159 0.827079
H  -5.236323 1.228692 -1.187617
H  -6.203355 0.426158 0.095519
H  -5.456139 -0.539608 -1.230378
H  5.23443 -0.491397 -1.836019
