program: Gaussian 09
title: 000108476
version: EM64L-G09RevD.01
frameworkgroup: C1[X(C15H19NO3)]
method: RPBEPBE
basis: SDD
operation: Freq
keyword: #p
keyword: freq=noraman
keyword: PBEPBE/SDD
title: #p freq=noraman PBEPBE/SDD
converged: YES YES NO NO
title: Mulliken charges:
elementType: O O O N C C C C C C C C C C C C C C C H H H H H H H H H H H H H H H H H H H
charge: -0.264525 -0.239694 -0.217947 -0.352401 -0.198404 -0.445077 -0.513320 0.154875 0.239634 -0.374806 -0.382827 -0.278254 -0.563713 0.503703 -0.413271 -0.413820 -0.227626 -0.227608 -0.242292 0.266059 0.244312 0.244380 0.253215 0.255052 0.326548 0.210920 0.213069 0.213334 0.214558 0.229467 0.230957 0.208574 0.207881 0.230813 0.230786 0.224482 0.224400 0.228569
chargesum: 0.00000
title: Mulliken charges with hydrogens summed into heavy atoms:
elementType: O O O N C C C C C C C C C C C C C C C
charge: -0.264525 -0.239694 -0.217947 -0.025853 0.067654 0.043614 -0.005053 0.154875 0.239634 0.049183 0.045065 0.182169 -0.147258 0.503703 -0.182458 -0.183034 -0.003144 -0.003208 -0.013723
polarizability: 2.35632884e+02 1.00801676e+01 1.48859655e+02 7.03254183e+00 -9.95830168e+00 1.34108561e+02
1716.lowfreq: -9.6771 -4.9303 -0.0005 -0.0002 0.0007 2.5717 6.3421 18.9104 23.9698
frequency: -8.9049 18.3967 23.0364 30.5350 38.1001 62.4817 74.8206 97.1139 98.8285 118.3804 163.8490 173.4433 190.2929 260.1056 312.7511 319.6675 332.6761 369.6573 403.2896 431.5116 464.9271 495.3323 514.4615 578.8957 584.0083 618.5267 625.6480 635.2038 682.3820 705.6161 743.9113 759.4225 777.7064 788.9143 798.2018 811.7965 844.8208 853.4190 876.8202 904.7205 907.5194 917.8231 948.0798 975.7251 989.9130 993.9188 1006.2163 1020.7990 1028.7103 1040.7473 1049.2552 1053.3687 1093.4351 1105.1931 1108.8557 1123.1147 1154.8228 1158.3578 1171.7876 1172.3200 1186.8910 1218.5729 1231.1216 1239.1680 1243.6567 1261.9208 1274.5522 1278.9884 1289.1229 1309.2788 1322.0471 1327.5776 1337.9042 1347.7616 1373.5896 1383.1638 1384.6009 1441.1608 1452.8606 1467.0629 1468.1132 1478.2139 1481.3927 1484.3770 1489.6114 1593.9525 1614.8651 1642.2320 1675.8785 2971.6538 2979.7795 2990.0391 3004.5244 3014.5794 3016.6082 3019.8306 3035.8040 3037.3127 3052.7146 3078.7572 3095.0827 3110.5284 3113.6335 3114.2861 3131.6562 3143.6306 3162.5981 3573.8468
redmass: 4.8494 4.3889 4.8226 5.5710 4.4940 4.9526 3.3602 2.4514 2.7174 2.9693 2.5330 5.9561 4.8367 3.6801 5.0617 4.0238 2.3374 4.2237 2.8154 5.2084 4.3320 1.6450 3.4218 3.2643 3.5728 6.3566 3.2872 3.0726 4.8972 1.7328 1.0740 1.9754 4.4711 1.1954 2.7834 3.5314 4.6842 1.2466 3.3727 1.3487 2.8150 1.5122 3.3311 1.3881 6.3005 1.3201 2.2625 3.8926 2.3746 2.0672 1.5161 3.0289 3.2473 1.4074 1.9936 3.1236 1.4151 1.2575 1.4095 1.0565 1.1182 2.3567 1.6682 1.3117 1.3126 1.9919 1.4208 1.1208 1.1216 1.3650 1.4246 1.2514 1.7053 1.4499 1.5434 7.8581 1.8151 2.1807 1.0864 1.0986 1.0774 1.1008 1.0886 2.2550 1.1026 6.0623 6.2103 10.8908 8.8473 1.0589 1.0596 1.0594 1.0568 1.0997 1.0819 1.0643 1.1030 1.0672 1.1054 1.1082 1.0983 1.1034 1.0881 1.0864 1.0903 1.0957 1.1014 1.0785
irintensity: 1.0311 0.1397 0.3559 1.1565 0.7162 0.7773 0.4128 0.3972 0.0397 1.4863 3.4087 0.9645 4.6914 7.9254 10.4159 3.4247 0.0770 15.3068 0.0006 2.4847 10.1353 42.6376 9.0696 22.0282 7.6452 0.0497 63.1575 26.5558 21.5506 53.3787 5.3657 51.1955 7.9874 0.5164 9.7654 1.4021 10.7273 0.0010 5.9587 1.3931 18.1384 4.5029 28.0089 0.0162 0.0341 0.3301 19.4891 16.4962 2.0633 27.9326 2.8730 1.5141 71.2582 10.1584 8.8854 415.6509 82.7986 3.0308 3.5548 0.1382 0.2643 0.1734 46.0488 0.0891 16.8886 56.3800 5.2838 0.7450 0.0084 1.6071 3.9140 0.0878 14.4765 0.1607 6.6117 0.0519 30.1158 6.7052 9.2119 0.6501 1.1491 1.7770 7.5328 17.1732 22.6923 1.4624 10.5713 162.0840 475.1388 0.3283 31.9186 36.3258 34.2954 0.0269 17.9997 8.8511 3.7974 27.6521 25.3480 60.8611 5.7794 24.1545 7.8438 12.6247 9.1905 44.8423 23.9550 33.0012
temp: 298.150 k
press: 1.00000 atm
elementType: 8 8 8 7 6 6 6 6 6 6 6 6 6 6 6 6 6 6 6 1 1 1 1 1 1 1 1 1 1 1 1 1 1 1 1 1 1 1
symmnumber: 1
zpe: 822732.5 jmol-1
zpe.correction: 0.313362 hartree
zpe.thermalcorrener: 0.331218 hartree
zpe.thermalcorrenthalpy: 0.332162 hartree
zpe.thermalcorrgfe: 0.263406 hartree
zpe.sumelectzpe: -862.019491 hartree
zpe.sumelectthermal: -862.001635 hartree
zpe.sumelectthermalent: -862.000691 hartree
zpe.sumelectthermalfe: -862.069447 hartree
dipole: -5.0286 1.2114 3.3597
dipole: 6.1678
quadrupole: -154.0856 -104.4838 -116.4546
quadrupole: 7.9367 22.3857 -7.2320
quadrupole: -29.0776 20.5242 8.5534 7.9367 22.3857 -7.2320
hfenergy: -862.3328529 hartree
pointgroup: C01 [X(C15H19N1O3)]
dipole: 1.9819103 -0.3268388 1.361502 debye
polarizability: 235.5322492|9.6292909|150.8576865|-8.2543713|8.1436356|132.2111634 unknown
InChI: InChI=1S/C15H19NO3/c17-14-10-9-13(16-14)15(18)19-11-5-4-8-12-6-2-1-3-7-12/h1-3,6-7,13,16H,4-5,8-11H2
charge 0 multiplicity 1
38 atoms
O  -1.770194 0.24327 0.574445
O  -7.247025 0.01982 -1.053561
O  -2.921231 1.097702 -1.268061
N  -5.389491 0.844395 0.146009
C  -4.157359 0.375854 0.775904
C  -4.446903 -1.152143 1.004232
C  -5.509849 -1.503202 -0.063874
C  -6.187197 -0.161389 -0.401948
C  -2.921757 0.62144 -0.112679
C  0.637654 -0.05481 0.778228
C  2.030753 0.095694 0.123589
C  -0.473319 0.426848 -0.153393
C  3.173326 -0.400949 1.052632
C  4.547997 -0.235262 0.420582
C  5.105757 -1.258836 -0.388526
C  5.284217 0.965623 0.591464
C  6.36268 -1.088141 -1.012045
C  6.541491 1.141971 -0.029417
C  7.08515 0.114653 -0.835123
H  -3.964857 0.877251 1.742136
H  -3.524956 -1.749446 0.936535
H  -4.865226 -1.282419 2.016774
H  -5.061965 -1.900507 -0.993468
H  -6.261716 -2.229934 0.281386
H  -5.555369 1.824453 -0.08602
H  0.458091 -1.114721 1.04358
H  0.600329 0.524314 1.721021
H  2.066987 -0.471271 -0.828187
H  2.214507 1.157109 -0.137609
H  -0.517037 -0.154122 -1.093072
H  -0.371357 1.49662 -0.413563
H  2.991674 -1.465874 1.298064
H  3.123043 0.161596 2.005733
H  4.55413 -2.197875 -0.525044
H  4.871648 1.764562 1.220864
H  6.779795 -1.891614 -1.629896
H  7.097905 2.074747 0.117699
H  8.061174 0.247795 -1.315087
