program: Gaussian 09
title: 000108464
version: EM64L-G09RevD.01
frameworkgroup: C1[X(C13H20O)]
method: RPBEPBE
basis: SDD
operation: Freq
keyword: #pfreq=noraman
keyword: PBEPBE/SDD
title: #p freq=noraman PBEPBE/SDD
converged: YES YES NO NO
title: Mulliken charges:
elementType: O C C C C C C C C C C C C C H H H H H H H H H H H H H H H H H H H H
charge: -0.463660 -0.333801 -0.112738 -0.079370 -0.196706 0.371682 -0.535476 -0.564945 -0.508480 -0.518660 -0.418729 -0.610190 -0.037844 -0.611780 0.264120 0.226687 0.221633 0.236189 0.256895 0.224222 0.205420 0.255839 0.215355 0.219381 0.221106 0.214973 0.215685 0.199172 0.229468 0.211110 0.329719 0.228517 0.217980 0.227226
chargesum: 0.00000
title: Mulliken charges with hydrogens summed into heavy atoms:
elementType: O C C C C C C C C C C C C C
charge: -0.133941 -0.069681 0.113949 0.142263 0.039483 0.371682 -0.054358 -0.103685 -0.073744 -0.082581 -0.003872 -0.169612 0.190673 -0.166574
polarizability: 1.65800347e+02 -3.20297301e+00 1.25714698e+02 4.60606233e+00 -3.98639818e+00 1.09698284e+02
1716.lowfreq: -15.9272 -10.6378 -0.0005 -0.0004 0.0001 18.4085 55.6258 71.3446 106.0875
frequency: 55.3889 71.3061 106.0755 144.4970 194.0247 202.7729 260.8537 275.2914 299.6895 336.6834 375.5869 396.1438 421.8017 443.1016 480.1736 485.9567 531.9754 545.0007 617.9710 667.7345 718.2134 746.9790 785.2910 795.2717 846.9203 850.5174 869.1523 890.9572 905.4781 913.8741 917.0174 921.6921 935.4832 948.3530 952.2181 965.1837 996.4386 1006.2882 1009.5165 1020.8572 1040.8778 1042.3697 1054.6389 1070.3559 1090.6833 1116.3417 1127.3430 1149.7535 1159.5531 1161.5088 1186.0612 1194.8698 1214.3617 1232.0824 1240.5598 1251.8898 1263.2089 1267.6958 1271.8943 1282.4060 1286.3094 1288.8157 1303.1780 1306.5291 1309.6990 1316.7963 1333.6689 1353.2279 1422.1309 1456.0965 1458.3680 1464.8932 1469.9818 1472.2868 1491.4309 1646.6995 2983.4563 2984.8793 2987.6377 2989.7238 2991.6482 3004.6011 3012.4854 3021.1595 3042.6186 3047.6643 3048.1776 3050.2229 3057.6648 3064.5471 3076.1163 3079.5206 3092.7587 3093.2928 3193.9305 3497.6278
redmass: 3.6467 2.9532 2.8745 2.6204 2.9131 2.2193 3.2341 2.5111 3.3175 2.2580 2.9907 2.2959 1.3256 1.8791 2.1957 2.2587 2.5545 1.9404 2.6711 2.2694 2.4336 3.5280 3.0671 3.2590 2.1920 2.1159 2.2671 1.5759 2.4030 2.2090 2.0385 2.4345 2.0388 1.6444 1.5320 1.8243 1.6809 1.5623 1.2144 1.8094 1.7313 1.5160 1.4427 1.6238 2.1939 1.4504 1.4048 2.2107 1.5851 1.6184 2.4929 1.5958 1.5653 1.4363 1.3703 1.3433 1.3676 1.3634 1.3919 1.4464 1.3596 1.2902 1.3585 1.3858 1.5503 1.3711 1.5006 1.7347 1.1684 1.0858 1.1111 1.0866 1.0899 1.0999 1.0903 4.5011 1.0588 1.0626 1.0670 1.0810 1.0626 1.0616 1.0858 1.0616 1.0878 1.0971 1.0994 1.1016 1.0913 1.1041 1.1022 1.0687 1.0853 1.1044 1.1147 1.0650
irintensity: 0.2321 0.3629 0.5333 0.1021 0.4347 0.4687 2.2045 2.4450 1.7272 2.4523 3.3529 9.9162 117.0126 3.1877 7.1252 9.4062 2.1565 3.9517 4.3465 3.7690 12.0422 6.6479 3.5418 1.0866 7.1263 9.5728 8.4151 0.9965 4.7854 2.2908 5.0917 2.8920 1.7491 17.0824 52.4937 3.3931 13.8810 5.5968 17.2857 24.3298 4.0526 4.9757 8.9129 25.9165 2.1373 2.0534 6.8508 15.3747 0.6627 2.7815 6.4538 0.5158 1.5683 8.3573 0.7074 34.5237 0.1898 3.8506 2.4390 3.1385 2.5721 3.7932 4.0043 5.9949 4.6396 1.8178 2.1614 37.6395 4.6560 9.2367 20.9617 4.4356 9.3899 7.5680 20.3878 15.4245 39.4447 45.1777 19.9654 13.4848 6.5538 37.7208 52.8742 32.9432 57.5343 31.9221 42.9850 33.6336 19.2054 89.5182 24.8217 23.4071 6.2687 25.0322 23.2382 7.5869
temp: 298.150 k
press: 1.00000 atm
elementType: 8 6 6 6 6 6 6 6 6 6 6 6 6 6 1 1 1 1 1 1 1 1 1 1 1 1 1 1 1 1 1 1 1 1
symmnumber: 1
zpe: 789691.0 jmol-1
zpe.correction: 0.300777 hartree
zpe.thermalcorrener: 0.313458 hartree
zpe.thermalcorrenthalpy: 0.314402 hartree
zpe.thermalcorrgfe: 0.262402 hartree
zpe.sumelectzpe: -581.483263 hartree
zpe.sumelectthermal: -581.470582 hartree
zpe.sumelectthermalent: -581.469638 hartree
zpe.sumelectthermalfe: -581.521638 hartree
dipole: -0.4949 -1.6048 -0.4433
dipole: 1.7369
quadrupole: -84.7581 -88.8198 -85.6813
quadrupole: -3.7479 0.5643 -3.0504
quadrupole: 1.6616 -2.4001 0.7384 -3.7479 0.5643 -3.0504
hfenergy: -581.7840401 hartree
pointgroup: C01 [X(C13H20O1)]
dipole: -0.1811618 0.6410656 0.1522859 debye
polarizability: 165.7962704|2.2207098|125.2916755|-5.3752687|-4.5127009|110.1253825 unknown
InChI: InChI=1S/C13H20O/c1-2-6-13(14)8-9-7-12(13)11-5-3-4-10(9)11/h2,9-12,14H,1,3-8H2
charge 0 multiplicity 1
34 atoms
O  2.131709 -1.416642 -0.808294
C  0.095234 0.023394 -0.840317
C  -0.890579 0.844801 0.047183
C  -1.703595 -0.280273 0.818493
C  -1.073465 -1.597211 0.26613
C  1.191801 -0.656997 0.053852
C  -0.76684 -1.219331 -1.213055
C  0.368593 -1.731931 0.842752
C  -1.952727 1.677873 -0.729428
C  -3.199685 -0.036666 0.46661
C  -3.271236 1.458165 0.057681
C  2.028592 0.291988 0.963163
C  2.776165 1.345652 0.171905
C  4.110432 1.318187 -0.087388
H  0.519429 0.592526 -1.685427
H  -0.354533 1.510425 0.748264
H  -1.55708 -0.209692 1.913499
H  -1.70024 -2.491475 0.42227
H  -0.180683 -1.987856 -1.743683
H  -1.665048 -0.97274 -1.805461
H  0.405309 -1.568128 1.935478
H  0.802966 -2.722694 0.624519
H  -2.06708 1.289577 -1.760457
H  -1.675264 2.744803 -0.810086
H  -3.876188 -0.283766 1.304629
H  -3.495979 -0.67054 -0.392592
H  -4.173202 1.703603 -0.532483
H  -3.281051 2.096764 0.963245
H  2.74552 -0.338192 1.522896
H  1.3633 0.773062 1.704902
H  2.743622 -0.758194 -1.234224
H  2.1707 2.165836 -0.244672
H  4.596455 2.095549 -0.688167
H  4.75575 0.527324 0.315863
