program: Gaussian 09
title: 000108458
version: EM64L-G09RevD.01
frameworkgroup: C1[X(C14H13ClO)]
method: RPBEPBE
basis: SDD
operation: Freq
keyword: #p
keyword: freq=noraman
keyword: PBEPBE/SDD
title: #p freq=noraman PBEPBE/SDD
converged: NO YES NO NO
title: Mulliken charges:
elementType: Cl O C C C C C C C C C C C C C C H H H H H H H H H H H H H
charge: -0.110368 -0.129442 0.037113 0.283710 -0.221710 0.255748 -0.274528 -0.719099 -0.713812 -0.051026 0.322881 -0.466378 -0.402421 -0.421120 -0.270626 -0.232712 0.295117 0.261057 0.221727 0.250331 0.227741 0.223843 0.225784 0.231083 0.254044 0.218787 0.248231 0.227050 0.228994
chargesum: 0.00000
title: Mulliken charges with hydrogens summed into heavy atoms:
elementType: Cl O C C C C C C C C C C C C C C
charge: -0.110368 -0.129442 0.037113 0.283710 0.073407 0.255748 -0.013471 -0.019300 -0.033102 -0.051026 0.322881 -0.212334 -0.183635 -0.172889 -0.043576 -0.003718
polarizability: 2.18687642e+02 1.06140061e+01 1.42920057e+02 6.83229970e+00 -2.02336447e+01 1.36840022e+02
1716.lowfreq: -7.9677 -3.1549 -0.0015 0.0002 0.0005 6.2959 34.2186 60.2734 74.1690
frequency: 34.2006 60.2595 74.1655 119.1066 128.5373 150.9483 169.0749 191.1882 229.6992 241.6103 256.6368 285.9588 343.2370 363.8074 385.1490 410.5646 429.6058 460.9996 488.2745 536.2247 554.8387 569.9619 636.1968 668.9195 682.1446 721.4842 738.0170 747.2141 769.9214 802.4828 815.1812 853.5180 878.4040 920.6244 936.6113 946.6027 952.9120 954.7176 984.4863 992.8532 1016.9675 1027.7136 1069.8630 1077.1733 1113.0276 1125.6154 1134.0011 1173.0939 1193.5549 1225.2053 1244.8230 1297.2984 1304.5298 1341.7600 1373.3880 1391.0705 1403.8149 1408.0830 1449.1624 1457.9767 1462.3786 1465.7432 1482.0165 1491.3351 1553.3356 1596.3469 1619.0966 1729.0113 2989.4971 2993.1806 3071.4819 3076.9303 3116.3393 3119.5319 3126.6457 3133.9983 3146.3634 3164.4291 3171.9774 3177.6145 3218.9061
redmass: 9.7662 4.5262 4.3490 1.2797 3.7461 2.3823 3.9068 1.8892 2.3132 3.9651 3.8507 3.7614 3.7544 2.9527 5.0420 4.7719 3.1922 3.8392 4.0977 3.5998 6.1401 3.2749 5.7761 4.0216 4.0670 3.4505 3.7923 2.8262 1.6544 3.8578 2.2308 4.5060 1.4942 3.0037 1.3474 1.4301 1.4885 1.3950 1.3278 2.6206 1.3611 2.0744 2.5433 1.7709 1.7091 1.2773 2.2713 1.1028 2.3555 2.4383 2.2022 1.7420 2.0520 2.0519 2.9596 1.2419 2.5606 1.4095 2.4868 1.9102 1.3981 1.0492 1.0946 1.0583 5.7215 6.5189 7.2753 10.9994 1.0384 1.0381 1.0996 1.0988 1.0974 1.0953 1.0859 1.0893 1.0945 1.1003 1.0898 1.0916 1.1019
irintensity: 0.0368 0.4120 0.7903 0.2258 1.7004 1.5139 0.2878 1.8199 9.8271 1.7080 1.8891 5.8905 1.4234 7.2912 11.7567 9.4498 2.4173 3.1561 40.0132 1.2667 2.3544 2.8148 4.2633 15.9862 35.0129 108.0037 13.5971 14.2066 94.8308 63.7674 27.7328 6.3800 14.0237 4.4185 1.7032 3.6884 16.0059 6.0128 0.5678 109.9127 6.3407 22.3969 160.1121 10.4144 38.1079 5.8262 2.1653 0.7516 12.0483 7.7922 13.9878 4.3962 20.3874 16.6536 88.0788 22.9491 10.3792 7.2582 5.8805 15.1015 31.0700 5.1356 4.5647 16.1731 1.8919 1.3596 1.1289 218.1524 9.6676 50.2864 0.5337 38.3844 6.6448 19.4938 3.7339 3.0092 32.8384 30.0669 0.2071 6.1949 3.7035
temp: 298.150 k
press: 1.00000 atm
elementType: 17 8 6 6 6 6 6 6 6 6 6 6 6 6 6 6 1 1 1 1 1 1 1 1 1 1 1 1 1
symmnumber: 1
zpe: 593471.1 jmol-1
zpe.correction: 0.226041 hartree
zpe.thermalcorrener: 0.240866 hartree
zpe.thermalcorrenthalpy: 0.241810 hartree
zpe.thermalcorrgfe: 0.183814 hartree
zpe.sumelectzpe: -1075.409176 hartree
zpe.sumelectthermal: -1075.394351 hartree
zpe.sumelectthermalent: -1075.393407 hartree
zpe.sumelectthermalfe: -1075.451403 hartree
dipole: -2.9977 1.6933 2.5774
dipole: 4.3007
quadrupole: -106.5369 -100.1888 -96.4568
quadrupole: 7.1086 8.3704 -3.5765
quadrupole: -5.4760 0.8720 4.6040 7.1086 8.3704 -3.5765
hfenergy: -1075.635217 hartree
pointgroup: C01 [X(C14H13Cl1O1)]
dipole: 1.0551449 0.8811957 0.9864823 debye
polarizability: 220.3180872|-1.6300763|144.3464275|-0.5213395|-20.4124945|133.7832064 unknown
InChI: InChI=1S/C14H13ClO/c1-13(2)11(12(15)16)14(13)8-7-9-5-3-4-6-10(9)14/h3-8,11H,1-2H3
charge 0 multiplicity 1
29 atoms
Cl -3.314784 0.03547 -2.662459
O  -3.124667 -1.409059 -0.338959
C  -0.321321 -0.075272 0.337658
C  -1.335791 0.957218 0.910187
C  -1.525589 0.448939 -0.550948
C  1.09666 0.219607 -0.091607
C  -0.269005 -1.470926 0.892176
C  -2.294564 0.493865 2.0076
C  -0.932366 2.421528 1.073783
C  -2.620331 -0.457604 -0.93234
C  1.900634 -0.909803 0.275685
C  1.024537 -1.926608 0.881359
C  1.679088 1.300038 -0.779013
C  3.283986 -0.933889 0.003863
C  3.070824 1.272224 -1.056542
C  3.86777 0.171839 -0.660232
H  -1.233152 1.14978 -1.335329
H  -1.141618 -2.010001 1.260634
H  -3.134927 1.207032 2.092425
H  -2.72023 -0.504453 1.82675
H  -1.764735 0.473944 2.977285
H  -0.275929 2.788856 0.271265
H  -1.836473 3.057371 1.093025
H  -0.398008 2.558432 2.031887
H  1.36365 -2.897568 1.249376
H  1.087147 2.152964 -1.128163
H  3.894592 -1.797709 0.289231
H  3.531241 2.110147 -1.591348
H  4.940257 0.17154 -0.884049
