program: Gaussian 09
title: 000108444
version: EM64L-G09RevD.01
frameworkgroup: C1[X(C12H14O)]
method: RPBEPBE
basis: SDD
operation: Freq
keyword: #pfreq=noraman
keyword: PBEPBE/SDD
title: #p freq=noraman PBEPBE/SDD
converged: YES YES NO NO
title: Mulliken charges:
elementType: O C C C C C C C C C C C C H H H H H H H H H H H H H H
charge: -0.277316 -0.150680 -0.612881 -0.540889 0.598667 -0.318958 0.444263 -0.424389 -0.390889 -0.769675 -0.228915 -0.225217 -0.242020 0.214076 0.230063 0.230132 0.220566 0.212681 0.222643 0.192158 0.228901 0.267694 0.223486 0.223159 0.223777 0.223192 0.226371
chargesum: 0.00000
title: Mulliken charges with hydrogens summed into heavy atoms:
elementType: O C C C C C C C C C C C C
charge: -0.277316 0.063396 -0.152686 -0.107642 0.598667 0.095844 0.444263 -0.195489 -0.123195 -0.323029 -0.005138 -0.002025 -0.015649
polarizability: 1.73520756e+02 4.51121811e+00 1.25841221e+02 7.57441920e+00 1.42885721e+01 8.36168729e+01
1716.lowfreq: -7.4065 -0.0005 -0.0004 -0.0003 3.6249 15.8676 28.1759 79.7509 91.8094
frequency: 27.3881 79.7169 91.8056 122.2408 203.3290 251.3900 276.8466 321.4178 389.2273 400.3998 402.9075 468.6253 478.3418 517.9264 594.5514 615.8434 651.5467 704.9592 708.6294 759.7567 787.4819 807.0089 837.7602 857.1414 884.6560 916.3074 938.6650 946.9530 979.5643 983.4517 989.3674 991.3338 996.7235 1014.8788 1028.2189 1039.9088 1069.0756 1084.7022 1166.2761 1171.6092 1183.8084 1201.2190 1216.6185 1225.7923 1253.0865 1285.6616 1299.7145 1311.4140 1318.4638 1348.3847 1360.8384 1386.8638 1431.8980 1439.0867 1439.2912 1454.1772 1466.6994 1484.2164 1594.3434 1616.0663 1671.7245 2923.4753 2948.3539 2977.5565 2981.8790 3050.9481 3057.6945 3077.6000 3085.2850 3110.8704 3125.2332 3138.8178 3156.2455 3169.5307 3188.3568
redmass: 3.7953 3.5613 3.6560 3.2798 2.9273 4.0550 3.5882 3.5675 2.7721 2.3054 2.7852 2.8146 2.6844 3.2099 3.8896 6.4131 3.6494 1.8445 1.0886 1.7921 2.3143 3.1020 3.1497 1.2501 2.4011 1.5147 1.3841 2.0496 1.3810 1.8544 4.1264 2.7412 1.3656 2.4311 2.0353 5.2366 1.9415 1.6911 1.2713 1.0553 1.1098 1.2866 1.6690 1.3486 1.3696 1.9863 1.2737 1.4556 1.3707 1.5528 1.3835 5.5704 1.1506 1.1005 2.1262 1.1255 1.0897 2.3810 6.1927 6.1382 5.6105 1.0832 1.0680 1.0610 1.0620 1.0993 1.0999 1.0973 1.0625 1.0873 1.0866 1.0927 1.0972 1.0978 1.1140
irintensity: 0.2894 0.6111 0.2749 1.0063 1.9349 0.4662 3.3347 5.0923 0.7788 0.6799 0.7633 0.4124 1.4206 5.7577 26.2790 0.0218 25.6946 50.4720 0.5611 40.7155 10.3055 1.8023 3.6496 0.0699 5.2737 0.2871 75.4668 5.3600 0.2937 19.9387 2.6665 7.0890 1.7873 17.5397 5.9227 92.6734 8.5778 4.2070 4.8470 0.7073 2.2128 3.2723 1.8576 25.2651 6.3082 2.4954 1.2127 15.4423 3.9434 23.6616 2.8131 1.0927 3.9659 11.8991 11.4248 12.2260 5.6100 15.0584 1.1515 6.6116 35.3449 32.4834 73.9039 23.4194 26.5261 44.3896 20.1220 37.4941 8.7486 10.0690 1.0096 32.1830 32.3906 10.3993 22.1597
temp: 298.150 k
press: 1.00000 atm
elementType: 8 6 6 6 6 6 6 6 6 6 6 6 6 1 1 1 1 1 1 1 1 1 1 1 1 1 1
symmnumber: 1
zpe: 595376.3 jmol-1
zpe.correction: 0.226767 hartree
zpe.thermalcorrener: 0.238047 hartree
zpe.thermalcorrenthalpy: 0.238991 hartree
zpe.thermalcorrgfe: 0.188759 hartree
zpe.sumelectzpe: -539.914055 hartree
zpe.sumelectthermal: -539.902775 hartree
zpe.sumelectthermalent: -539.901831 hartree
zpe.sumelectthermalfe: -539.952063 hartree
dipole: 1.0734 0.7203 0.0448
dipole: 1.2935
quadrupole: -68.9816 -75.3762 -79.3458
quadrupole: -3.7937 2.8503 4.3503
quadrupole: 5.5862 -0.8083 -4.7779 -3.7937 2.8503 4.3503
hfenergy: -540.140822 hartree
pointgroup: C01 [X(C12H14O1)]
dipole: 0.4242777 -0.2791206 -0.0322806 debye
polarizability: 173.4233178|-3.6759377|124.6571374|-8.7344105|15.7896833|84.8983952 unknown
InChI: InChI=1S/C12H14O/c1-10-7-8-13-12(9-10)11-5-3-2-4-6-11/h2-6,12H,1,7-9H2
charge 0 multiplicity 1
27 atoms
O  0.914623 1.430865 -0.424037
C  0.463641 0.026466 -0.483433
C  1.248824 -0.824362 0.568234
C  3.210159 0.766798 0.299741
C  2.748886 -0.68069 0.367568
C  2.34961 1.546998 -0.726401
C  -1.034463 -0.004093 -0.236074
C  -1.812793 -1.064502 -0.762738
C  -1.662863 0.986086 0.558347
C  3.584992 -1.740707 0.2173
C  -3.197486 -1.142621 -0.49294
C  -3.048749 0.911689 0.823894
C  -3.820169 -0.153875 0.304047
H  0.689406 -0.379161 -1.496333
H  0.931859 -1.880738 0.498282
H  0.957593 -0.45039 1.57053
H  3.081781 1.247764 1.290545
H  4.278649 0.837359 0.023373
H  2.562645 2.628334 -0.695224
H  2.546669 1.165918 -1.752496
H  -1.337664 -1.828577 -1.391739
H  -1.061864 1.816966 0.939977
H  3.215742 -2.772644 0.255619
H  4.662379 -1.606607 0.062519
H  -3.78925 -1.96624 -0.908398
H  -3.528261 1.686204 1.433518
H  -4.894897 -0.20984 0.511121
