program: Gaussian 09
title: 000108382
version: EM64L-G09RevD.01
frameworkgroup: C1[X(C12H22O2)]
method: RPBEPBE
basis: SDD
operation: Freq
keyword: #pfreq=noraman
keyword: PBEPBE/SDD
title: #p freq=noraman PBEPBE/SDD
converged: YES YES NO NO
title: Mulliken charges:
elementType: O O C C C C C C C C C C C C H H H H H H H H H H H H H H H H H H H H H H
charge: -0.217603 -0.215475 -0.161690 -0.470417 -0.446060 -0.384493 -0.382015 -0.441796 -0.374383 0.195651 -0.304444 -0.353004 -0.356912 -0.695879 0.244134 0.230493 0.217014 0.231194 0.228794 0.206537 0.185949 0.196632 0.195160 0.214777 0.239694 0.188640 0.188214 0.199138 0.238998 0.189142 0.189341 0.194523 0.194324 0.210448 0.210164 0.215209
chargesum: 0.00000
title: Mulliken charges with hydrogens summed into heavy atoms:
elementType: O O C C C C C C C C C C C C
charge: -0.217603 -0.215475 0.082444 -0.022909 0.013928 0.007993 0.009777 0.012675 0.002471 0.195651 0.133693 0.025478 0.031935 -0.060058
polarizability: 1.66752730e+02 7.26027718e+00 1.27691599e+02 2.66990606e+00 3.26924131e+00 1.05582724e+02
1716.lowfreq: -11.0495 -4.9851 -0.0011 -0.0010 -0.0003 10.4072 24.4051 33.4880 42.5986
frequency: 24.0156 33.2678 42.5430 68.9022 89.0252 97.8926 102.7894 124.7316 140.2512 144.9829 180.4425 230.1978 231.3780 289.1321 339.1714 346.0057 385.3576 445.8803 465.0845 485.3657 530.9008 591.3133 663.1855 721.0799 726.3737 740.6603 758.4993 810.1852 852.1963 875.7947 884.8133 888.7745 917.3971 937.5911 991.8188 997.2901 1015.7479 1028.0421 1039.7135 1053.8774 1071.6455 1078.8928 1081.4463 1092.7945 1110.6606 1132.0152 1143.6971 1177.3979 1190.9176 1218.1223 1223.0326 1228.0077 1245.5601 1260.8886 1271.4607 1280.7630 1285.4383 1292.4299 1293.2043 1301.9929 1316.4949 1330.4482 1343.2472 1349.4095 1352.0776 1355.1669 1362.3927 1387.9449 1457.2321 1458.7885 1461.3114 1463.8056 1468.9883 1476.1318 1476.7929 1480.7151 1483.6994 1488.2617 1489.4601 1666.9003 2941.0938 2948.7829 2950.6863 2954.0982 2961.6414 2967.7601 2971.8426 2984.6252 2987.9937 2991.2146 2992.9107 2997.0343 3004.0739 3010.4682 3022.3185 3037.2516 3049.8829 3054.3170 3068.5514 3070.9555 3074.5350 3099.5140
redmass: 2.7360 2.1338 3.5695 2.7552 2.0136 1.9425 3.8341 3.1988 2.0223 2.2302 5.3310 1.2401 2.6537 2.1659 3.0528 3.2886 3.7284 5.1523 3.5013 3.3113 5.2501 2.6034 3.6760 1.0718 1.1834 1.8262 1.2811 1.2425 1.8975 2.5492 1.9163 1.8668 2.4068 1.5265 1.9234 1.9391 2.9206 3.5503 1.5795 2.8452 2.3922 2.1139 2.3444 2.8858 2.1889 2.8193 1.9726 1.3897 1.5979 1.2731 1.3679 1.2968 1.3081 1.2955 1.2003 1.0519 1.1873 1.2686 1.0914 1.1694 1.2840 1.4355 1.4043 1.4799 1.3560 1.6612 1.6210 1.2168 1.0795 1.0762 1.0718 1.0703 1.0784 1.0765 1.0441 1.0836 1.0855 1.0912 1.0847 11.7901 1.0802 1.0592 1.0592 1.0591 1.0594 1.0590 1.0362 1.0964 1.0619 1.0676 1.0936 1.0630 1.1000 1.0626 1.1038 1.1043 1.1030 1.1023 1.1006 1.0994 1.1028 1.1001
irintensity: 0.0633 1.4058 1.3704 0.0080 0.4705 0.0326 1.0644 1.3023 0.0525 0.5864 1.5646 0.3923 2.2890 1.7684 5.8194 3.9621 1.3041 1.1276 1.5947 0.5630 0.6797 9.1376 2.2163 15.2043 0.0856 4.1698 1.9977 1.5657 4.2636 5.3666 7.0406 7.1057 16.1141 4.3643 21.2535 2.3137 64.4043 52.0951 14.8404 8.4609 24.5877 0.0795 3.7587 95.6144 4.6808 5.9985 2.8020 5.6811 1.4295 8.1361 16.8390 22.1081 4.6746 6.1411 0.8340 0.3281 0.1823 6.5478 0.8390 1.9019 1.4055 3.3870 1.3210 0.2664 2.9124 0.8924 3.9980 11.1483 7.6249 1.1821 0.0378 0.5492 1.0948 3.4245 11.5183 6.8676 4.9574 26.5536 4.3182 252.9425 10.7750 1.3698 8.2320 0.4663 19.7929 139.5212 38.8814 0.6542 27.4173 48.1300 3.8215 27.9827 0.8396 35.4049 0.1744 87.1642 4.8613 83.4472 95.5091 54.7350 51.0564 34.0785
temp: 298.150 k
press: 1.00000 atm
elementType: 8 8 6 6 6 6 6 6 6 6 6 6 6 6 1 1 1 1 1 1 1 1 1 1 1 1 1 1 1 1 1 1 1 1 1 1
symmnumber: 1
zpe: 837881.6 jmol-1
zpe.correction: 0.319132 hartree
zpe.thermalcorrener: 0.335463 hartree
zpe.thermalcorrenthalpy: 0.336408 hartree
zpe.thermalcorrgfe: 0.272922 hartree
zpe.sumelectzpe: -619.783268 hartree
zpe.sumelectthermal: -619.766937 hartree
zpe.sumelectthermalent: -619.765993 hartree
zpe.sumelectthermalfe: -619.829478 hartree
dipole: 1.3642 -5.0805 -0.7924
dipole: 5.3198
quadrupole: -94.4721 -95.3627 -85.0216
quadrupole: 19.9508 2.4542 -1.2744
quadrupole: -2.8533 -3.7439 6.5972 19.9508 2.4542 -1.2744
hfenergy: -620.1024001 hartree
pointgroup: C01 [X(C12H22O2)]
dipole: -0.5762853 -1.9929728 0.276646 debye
polarizability: 166.4216535|-7.9962289|128.071359|3.0068906|-3.0454377|105.5340408 unknown
InChI: InChI=1S/C12H22O2/c1-2-3-4-5-6-8-11-9-7-10-14-12(11)13/h11H,2-10H2,1H3
charge 0 multiplicity 1
36 atoms
O  4.374551 0.457157 0.387474
O  2.991518 2.178141 -0.205827
C  1.933786 -0.019291 0.256773
C  0.587899 0.6345 -0.127947
C  2.221138 -1.346682 -0.522169
C  -0.642593 -0.243648 0.190481
C  -1.976414 0.475921 -0.113192
C  3.719261 -1.764371 -0.461608
C  -3.221375 -0.388002 0.18873
C  3.092634 0.976188 0.105928
C  4.450247 -1.007221 0.655661
C  -4.553638 0.336704 -0.108576
C  -5.801092 -0.525094 0.192281
C  -7.126604 0.211173 -0.10006
H  1.900622 -0.276011 1.339612
H  0.499077 1.601686 0.402249
H  0.606659 0.883086 -1.20759
H  1.908527 -1.2125 -1.574118
H  1.580295 -2.140059 -0.098282
H  -0.605045 -1.186789 -0.391976
H  -0.622702 -0.535192 1.262514
H  -2.027756 1.413977 0.477624
H  -1.991747 0.781395 -1.180287
H  3.824627 -2.853512 -0.3014
H  4.224642 -1.525588 -1.415153
H  -3.203866 -0.697679 1.255006
H  -3.173449 -1.323739 -0.407321
H  4.016222 -1.219442 1.653072
H  5.529255 -1.224906 0.681016
H  -4.57277 0.647589 -1.174275
H  -4.603208 1.271857 0.487696
H  -5.778514 -0.839744 1.255855
H  -5.753984 -1.456813 -0.408069
H  -7.21246 1.128927 0.511892
H  -7.186657 0.511388 -1.163352
H  -8.002686 -0.426003 0.121139
