program: Gaussian 09
title: 000108253
version: EM64L-G09RevD.01
frameworkgroup: C1[X(C19H27ClN2O6)]
method: RPBEPBE
basis: SDD
operation: Freq
keyword: #p
keyword: freq=noraman
keyword: PBEPBE/SDD
title: #p freq=noraman PBEPBE/SDD
converged: YES YES NO NO
title: Mulliken charges:
elementType: Cl O O O O O O N N C C C C C C C C C C C C C C C C C C C H H H H H H H H H H H H H H H H H H H H H H H H H H H
charge: -0.046698 -0.325837 -0.407775 -0.229107 -0.311714 -0.317364 -0.292890 -0.411171 -0.368144 -0.413014 -0.364255 -0.159169 -0.374942 -0.405052 0.328708 0.143829 0.327251 -0.696239 -0.705196 -0.712129 0.328464 -0.422536 0.605325 -0.319809 -0.387093 -0.223138 -0.233287 -0.224092 0.226250 0.211613 0.206356 0.199513 0.301292 0.193778 0.268552 0.256639 0.206452 0.335468 0.194952 0.274188 0.227271 0.202433 0.229303 0.228433 0.209284 0.221141 0.269152 0.322487 0.386425 0.215065 0.272042 0.233559 0.256135 0.233165 0.236125
chargesum: 0.00000
title: Mulliken charges with hydrogens summed into heavy atoms:
elementType: Cl O O O O O O N N C C C C C C C C C C C C C C C C C C C
charge: -0.046698 -0.325837 -0.021349 -0.229107 -0.311714 -0.317364 -0.292890 -0.075703 -0.045657 0.024849 0.041614 0.142123 0.087387 0.058038 0.328708 0.143829 0.327251 0.000172 -0.045027 -0.012552 0.328464 0.064571 0.605325 -0.319809 -0.153533 0.032997 -0.000122 0.012033
polarizability: 2.82325960e+02 -3.09225552e+01 2.74161085e+02 1.31558118e+01 -1.15111001e+01 1.89850170e+02
1716.lowfreq: -4.2969 -2.2362 -0.0007 0.0000 0.0014 4.0841 7.8662 10.6857 16.7080
frequency: -3.8841 9.9393 16.4502 23.1746 27.8625 34.4096 37.7767 45.7610 53.8064 63.0255 77.0127 82.3270 102.7786 118.9846 126.5820 136.0975 149.4069 167.0356 179.6587 180.8077 205.0092 226.9877 240.8533 244.8317 249.6002 251.1485 268.5347 276.1928 288.9719 313.1547 315.1821 332.4344 351.6486 362.2485 395.3206 406.7347 421.8690 433.5847 436.8218 446.3638 481.4742 509.5363 538.0738 546.6433 565.4946 567.1761 574.6075 587.1895 607.7111 654.4185 669.4657 690.3872 692.6190 698.1535 705.2453 722.0942 727.6927 758.5321 760.8767 807.3779 823.0153 832.2533 839.4780 869.8945 890.4124 903.8699 915.7123 917.2386 923.8416 946.2173 954.4395 968.7417 973.0060 986.3328 988.1850 995.1950 1025.9719 1031.9807 1034.2738 1040.6153 1055.5157 1060.4115 1089.3021 1099.7059 1115.9292 1130.5256 1147.6768 1160.6518 1172.4644 1189.1057 1199.5301 1206.7653 1210.8102 1222.3807 1225.6037 1242.3026 1255.6693 1270.5802 1273.9579 1275.7483 1287.9897 1310.2081 1332.4606 1337.4529 1339.0677 1348.2617 1364.2460 1372.4143 1374.4044 1377.6386 1379.2552 1400.1603 1427.7633 1445.3903 1457.9911 1464.4002 1465.5321 1466.5764 1467.7438 1470.2829 1470.5971 1475.5600 1480.0513 1481.7448 1484.1556 1494.7712 1502.6310 1578.5814 1607.6892 1631.1342 1658.7981 1678.7463 2962.5936 2971.4236 2977.4702 2985.0027 2986.2397 2990.3638 2994.9682 3010.5797 3015.6585 3042.0284 3054.9052 3059.0818 3074.2384 3076.7095 3078.4636 3083.6770 3096.1965 3099.3514 3112.6787 3117.2482 3127.2082 3142.2918 3160.5459 3175.3961 3513.6482 3550.1354 3572.9206
redmass: 4.6204 6.0291 7.7265 5.3090 6.2347 4.5225 7.3121 7.3808 6.1031 6.1400 5.3465 4.7221 4.5854 3.7940 4.2895 5.0404 2.9534 5.8936 4.1725 1.1351 4.8613 4.4806 1.0702 3.0547 1.0706 4.0208 2.8743 4.0147 3.6785 3.5895 3.3344 2.5798 3.6131 3.6288 3.3820 2.8317 4.4647 2.8326 3.0412 2.7853 3.7153 2.4300 2.7616 3.8103 1.5196 1.7342 2.7314 1.4066 2.4821 5.6045 5.2532 3.8096 9.7253 7.0052 7.3034 3.9837 4.1737 1.3609 1.5606 2.4337 2.8841 2.1121 2.6392 1.6311 3.5579 3.7483 1.6104 2.7138 1.7862 1.4232 1.2040 3.2037 2.0541 1.4002 2.2580 3.5995 6.0976 1.4171 1.4159 2.0871 2.3707 2.2900 3.1632 2.6748 3.2919 1.6320 2.4196 2.1248 1.0626 1.9352 1.5668 1.1901 1.5368 2.1950 1.5969 1.4869 3.0493 1.9656 1.6980 1.3731 1.2139 1.3411 1.2475 1.6299 1.4959 1.3581 1.3172 1.4676 1.2400 1.4650 3.4818 1.2199 2.1647 1.0463 1.1506 1.0807 2.5965 1.0562 1.0619 1.0863 1.0691 1.1020 1.0610 1.3788 1.3170 1.7623 1.0667 6.2112 7.2993 8.4292 8.7651 9.4494 1.0602 1.0678 1.0639 1.0613 1.0373 1.0357 1.0362 1.0575 1.0979 1.0892 1.0965 1.0990 1.1064 1.0956 1.0982 1.0989 1.0991 1.1004 1.1000 1.0993 1.0877 1.0893 1.0949 1.0995 1.0642 1.0769 1.0767
irintensity: 0.5187 0.1157 0.3408 0.4731 0.1138 0.6006 4.0683 2.8410 4.3285 0.0665 8.6097 0.9945 0.2827 1.0809 4.6987 1.0295 0.7768 0.2643 1.3355 0.5131 6.9883 12.5303 0.2066 8.3783 0.4862 1.3630 0.5870 4.2072 3.7803 13.0848 3.5597 1.9298 1.0829 10.6627 18.6581 3.8573 6.8521 4.1898 4.0124 8.1681 3.8407 32.3770 13.0920 1.7090 7.2661 130.8641 28.1115 153.0298 66.3822 15.2820 11.4367 30.9813 39.9841 6.4804 26.5984 9.6711 0.1048 87.1489 35.8598 7.8427 13.6591 3.6807 23.3099 13.7813 3.8875 65.0848 2.2319 3.3195 5.1137 6.5684 0.2788 18.2604 20.5833 1.5714 8.2096 385.3728 53.0001 2.2420 6.5458 5.7877 118.0329 21.6709 19.3876 3.1979 46.3977 7.5240 129.8011 291.1483 2.8738 222.0794 11.1528 2.2624 119.7914 9.8228 13.0535 3.3991 33.3629 71.1808 42.0842 0.4296 1.4346 43.7893 2.7539 72.0299 96.3039 8.0895 3.0348 1.7310 53.2010 34.1403 8.9927 28.4704 27.2948 0.3834 79.1145 1.4910 21.8590 2.3470 11.7088 25.5000 13.8020 34.5137 4.0471 41.3897 89.3791 440.6724 27.7412 12.0943 4.1261 246.4214 184.8164 289.3974 19.5765 49.1788 52.8026 38.2215 30.9621 12.6252 28.9976 32.0856 23.5042 6.6113 8.7082 58.1545 16.8820 4.4636 12.4906 16.4699 50.5019 31.0430 7.9267 12.2187 7.2016 10.7009 16.3416 13.0815 29.1079 53.2873 22.1501
temp: 298.150 k
press: 1.00000 atm
elementType: 17 8 8 8 8 8 8 7 7 6 6 6 6 6 6 6 6 6 6 6 6 6 6 6 6 6 6 6 1 1 1 1 1 1 1 1 1 1 1 1 1 1 1 1 1 1 1 1 1 1 1 1 1 1 1
symmnumber: 1
zpe: 1159750.8 jmol-1
zpe.correction: 0.441726 hartree
zpe.thermalcorrener: 0.471554 hartree
zpe.thermalcorrenthalpy: 0.472499 hartree
zpe.thermalcorrgfe: 0.376403 hartree
zpe.sumelectzpe: -1759.031178 hartree
zpe.sumelectthermal: -1759.001350 hartree
zpe.sumelectthermalent: -1759.000406 hartree
zpe.sumelectthermalfe: -1759.096501 hartree
dipole: 1.0352 1.9493 -3.4609
dipole: 4.1047
quadrupole: -153.0894 -160.9698 -179.5973
quadrupole: -26.0754 8.3101 10.5156
quadrupole: 11.4627 3.5824 -15.0451 -26.0754 8.3101 10.5156
hfenergy: -1759.472904 hartree
pointgroup: C01 [X(C19H27Cl1N2O6)]
dipole: -0.3450099 -0.7395541 -1.3935675 debye
polarizability: 283.4392452|-31.1931425|273.5859516|-9.6688741|11.8276895|189.3120189 unknown
InChI: InChI=1S/C19H27ClN2O6/c1-19(2,3)28-18(26)22-15(16(23)24)10-6-7-11-21-17(25)27-12-13-8-4-5-9-14(13)20/h4-5,8-9,15,21-23H,6-7,10-12H2,1-3H3
charge 0 multiplicity 1
55 atoms
Cl 5.076891 2.378207 0.206236
O  -2.189029 -2.1650 -0.49794
O  -6.597762 1.521748 -0.145037
O  -6.282743 -0.362651 -1.468117
O  -2.427704 -0.526957 1.206934
O  2.108695 0.729284 0.444381
O  1.514539 2.177098 2.222354
N  -3.567646 -0.404445 -0.837785
N  0.476503 2.269287 0.110095
C  -3.864766 2.068125 -1.288115
C  -2.36743 2.401486 -1.107607
C  -4.321413 0.799014 -0.492953
C  -1.97128 2.815183 0.329537
C  -0.509798 3.311867 0.430939
C  -1.243541 -3.054376 0.305065
C  -5.805096 0.550893 -0.760201
C  -2.701888 -0.995914 0.067075
C  0.03673 -2.269317 0.653241
C  -0.959685 -4.189058 -0.693893
C  -1.979929 -3.569763 1.557776
C  1.36348 1.782322 1.038246
C  3.160577 0.132994 1.313081
C  4.299942 -0.314514 0.430419
C  5.231533 0.590046 -0.134801
C  4.477428 -1.691065 0.135807
C  6.293322 0.16942 -0.957293
C  5.535101 -2.142208 -0.683331
C  6.443896 -1.209419 -1.232013
H  -4.488247 2.9190 -0.953775
H  -4.07851 1.904983 -2.363512
H  -1.770484 1.523475 -1.426127
H  -2.117966 3.228317 -1.805031
H  -4.177382 0.980225 0.586851
H  -2.633766 3.637748 0.669296
H  -2.106181 1.965718 1.024181
H  -0.288709 3.645738 1.458998
H  -0.359543 4.178631 -0.245222
H  -3.829208 -0.929947 -1.674888
H  0.757048 -2.954786 1.138547
H  -0.183498 -1.439548 1.342719
H  0.508307 -1.858467 -0.2568
H  -0.277381 -4.928983 -0.238376
H  -1.89544 -4.700738 -0.977283
H  -0.4880 -3.791503 -1.608994
H  -1.341625 -4.302252 2.085128
H  -2.920274 -4.074162 1.272826
H  -2.210067 -2.742287 2.247439
H  0.492986 1.844614 -0.817391
H  -7.555989 1.357566 -0.360159
H  2.713616 -0.72763 1.841916
H  3.463836 0.893215 2.054751
H  3.766207 -2.410646 0.558781
H  6.990213 0.903813 -1.371352
H  5.649121 -3.210726 -0.893265
H  7.268709 -1.545359 -1.869353
